{"text_format":"1","workbook":"xlsx","n_sheets":5,"sheets":["Menu","Input","Results Imperial","Results SI","Calcs"],"not_rendered":{"charts":0,"images":1,"macros":1,"external_links":0,"defined_names":1,"comments":0,"pivot_tables":0},"unopened":[],"bounds":{"document_bytes":16777216,"sheet_cells":100000,"rows_first":2000,"rows_last":500,"rows_between":2000,"halvings":0,"cell_chars":16384,"cell_head_chars":4096},"cells_cut":0,"cells_raw":0,"read":"whole","date_system":"1900"}

{"sheet":"Menu","index":0,"n_rows":19,"n_cols":22,"rows_kept":19,"cut":false,"hidden":false,"merged":[]}
[]
[]
[]
[]
[null,null,null,null,null,null,null,"Data Import will ask you for the CSV file exported from Smart Thumper, It will import the data and convert it to Imperial and SI and then "]
[null,null,null,null,null,null,null,"let you update the dataset with adjusted sample weights and moisture content.  The default moisture content used in Smart thumper is 12 Percent."]
[null,null,null,null,null,null,null,"You may update the weight or MC on the INPUT tab.  If you do not update MC leave at zero.  Smart Thumper Calc will use an updated weight in lbs first if there is"]
[null,null,null,null,null,null,null,"a number greater than zero.  If you enter updated weights in KG make sure the numbers in the lbs column are zero."]
[null,null,null,null,null,null,null,null,null,null,null,null,null,null,null,null,null,null,null,null,"Set to Desired"]
[null,null,null,null,null,null,null,"Refresh your results after entering weight or MC data. If you have updated data enter it on the Input tab in the colored columns. ",null,null,null,null,null,null,null,null,null,null,null,null,"Final Adjusted MC %"]
[null,null,null,null,null,null,null,"Otherwise leave the colored columns Zero and not adjustments will be made.",null,null,null,null,null,null,null,null,null,null,null,null,null,15]
[null,null,null,null,null,null,null,null,null,null,null,null,null,null,null,null,null,null,null,null,"If Adjusting Moisture"]
[null,null,null,null,null,null,null,null,null,null,null,null,null,null,null,null,null,null,null,null,"Procedures for Developing"]
[null,null,null,null,null,null,null,"Export will prompt you for a location to create an export workbook with the name of \"current date + Smart Thumper Results\"",null,null,null,null,null,null,null,null,null,null,null,null,"Allowable Properties for a"]
[null,null,null,null,null,null,null,"Go to the location given to find your results",null,null,null,null,null,null,null,null,null,null,null,null,"Single Species Under  ASTM D1990"]
[null,null,null,null,null,null,null,null,null,null,null,null,null,null,null,null,null,null,null,null,"and Computer Programs Useful for"]
[null,null,null,null,null,null,null,null,null,null,null,null,null,null,null,null,null,null,null,null,"the Calculations  by"]
[null,null,null,null,null,null,null,null,null,null,null,null,null,null,null,null,null,null,null,null,"James W. Evans, David E. Kretschmann,"]
[null,null,null,null,null,null,null,null,null,null,null,null,null,null,null,null,null,null,null,null,"Victoria L. Herian, and David W. Green"]

{"sheet":"Input","index":1,"n_rows":51,"n_cols":15,"rows_kept":51,"cut":false,"hidden":false,"merged":[]}
["Specimen No.","Test Method","Date","Species","Depth","Width","Cross Section Size","Length","Weight","Frequency","Stiffness","Equivalent To","Weight","Weight","Current"]
[null,null,null,null,null,null,null,null,null,null,null,null,"lbs","Kg","MC%"]
["a","Vibration","2018-12-06","Southern Yellow Pine","2 Inch","8 Inch","2x8","12 Feet","41.61865 lb","6.05 Hz","0.90 Mpsi","No. 3",0,0,0]
["a - 1","Vibration","2018-12-06","Southern Yellow Pine","2 Inch","8 Inch","2x8","12 Feet","41.61865 lb","6.25 Hz","0.96 Mpsi","No. 3",0,0,0]
["b","Vibration","2018-12-06","Southern Yellow Pine","5.08 Centimeter","20.32 Centimeter","5.08x20.32","3.658 Meter","18.87996224 Kg","7.23 Hz","8845.86 MPa","No. 3",0,0,0]
["b - 1","Vibration","2018-12-06","Southern Yellow Pine","5.08 Centimeter","20.32 Centimeter","5.08x20.32","3.658 Meter","18.87996224 Kg","5.86 Hz","5811.11 MPa","No. 3",0,0,0]
["T","Vibration","15-06-2018","Southern Yellow Pine","1.5 Inch","7.25 Inch","1.5x7.25","12 Feet","28.287676 lb","6.45 Hz","1.81 Mpsi","No. 1",0,0,0]
["T - 1","Vibration","15-06-2018","Southern Yellow Pine","1.5 Inch","7.25 Inch","1.5x7.25","12 Feet","28.287676 lb","6.05 Hz","1.60 Mpsi","No. 2",0,0,0]
["T - 2","Vibration","15-06-2018","Southern Yellow Pine","1.5 Inch","7.25 Inch","1.5x7.25","12 Feet","28.287676 lb","6.64 Hz","1.92 Mpsi","No. 1",0,0,0]
["T - 3","Vibration","15-06-2018","Southern Yellow Pine","1.5 Inch","7.25 Inch","1.5x7.25","12 Feet","28.287676 lb","6.45 Hz","1.81 Mpsi","No. 1",0,0,0]
["T - 4","Vibration","15-06-2018","Southern Yellow Pine","1.5 Inch","7.25 Inch","1.5x7.25","12 Feet","28.287676 lb","6.05 Hz","1.60 Mpsi","No. 2",0,0,0]
["T - 5","Vibration","15-06-2018","Southern Yellow Pine","1.5 Inch","7.25 Inch","1.5x7.25","12 Feet","28.287676 lb","6.64 Hz","1.92 Mpsi","No. 1",0,0,0]
["T - 6","Vibration","15-06-2018","Southern Yellow Pine","3.81 Centimeter","18.415 Centimeter","3.81x18.415","3.658 Meter","12.832474335 Kg","6.45 Hz","12515.85 MPa","No. 1",0,0,0]
["T - 7","Vibration","15-06-2018","Southern Yellow Pine","3.81 Centimeter","18.415 Centimeter","3.81x18.415","3.658 Meter","12.832474335 Kg","6.05 Hz","11011.63 MPa","No. 2",0,0,0]
["T - 8","Vibration","15-06-2018","Southern Yellow Pine","3.81 Centimeter","18.415 Centimeter","3.81x18.415","3.658 Meter","12.832474335 Kg","6.64 Hz","13264.08 MPa","No. 1",0,0,0]
["T - 9","Vibration","15-06-2018","Southern Yellow Pine","3.81 Centimeter","18.415 Centimeter","3.81x18.415","3.658 Meter","12.832474335 Kg","6.45 Hz","12515.85 MPa","No. 1",0,0,0]
["T - 10","Vibration","15-06-2018","Southern Yellow Pine","3.81 Centimeter","18.415 Centimeter","3.81x18.415","3.658 Meter","12.832474335 Kg","6.05 Hz","11011.63 MPa","No. 2",0,0,0]
["T - 11","Vibration","15-06-2018","Southern Yellow Pine","3.81 Centimeter","18.415 Centimeter","3.81x18.415","3.658 Meter","12.832474335 Kg","6.64 Hz","13264.08 MPa","No. 1",0,0,0]
["T - 12","Soundwave","15-06-2018","Southern Yellow Pine","1.5 Inch","7.25 Inch","1.5x7.25","12.001 Feet","28.290033 lb","678.46 Hz","1.79 Mpsi","No. 2",0,0,0]
["T - 13","Soundwave","15-06-2018","Southern Yellow Pine","1.5 Inch","7.25 Inch","1.5x7.25","12.001 Feet","28.290033 lb","658.21 Hz","1.68 Mpsi","No. 2",0,0,0]
["T - 14","Soundwave","15-06-2018","Southern Yellow Pine","1.5 Inch","7.25 Inch","1.5x7.25","12.001 Feet","28.290033 lb","639.13 Hz","1.58 Mpsi","No. 2",0,0,0]
["T - 15","Soundwave","15-06-2018","Southern Yellow Pine","1.5 Inch","7.25 Inch","1.5x7.25","12.001 Feet","28.290033 lb","722.95 Hz","2.03 Mpsi","No. 1",0,0,0]
["T - 16","Soundwave","15-06-2018","Southern Yellow Pine","1.5 Inch","7.25 Inch","1.5x7.25","12.001 Feet","28.290033 lb","678.46 Hz","1.79 Mpsi","No. 2",0,0,0]
["T - 17","Soundwave","15-06-2018","Southern Yellow Pine","1.5 Inch","7.25 Inch","1.5x7.25","12.001 Feet","28.290033 lb","648.53 Hz","1.63 Mpsi","No. 2",0,0,0]
["T - 18","Soundwave","15-06-2018","Southern Yellow Pine","1.5 Inch","7.25 Inch","1.5x7.25","12.001 Feet","28.290033 lb","722.95 Hz","2.03 Mpsi","No. 1",0,0,0]
["T - 19","Soundwave","15-06-2018","Southern Yellow Pine","3.81 Centimeter","18.415 Centimeter","3.81x18.415","3.658 Meter","12.832474335 Kg","668.18 Hz","11948.25 MPa","No. 2",0,0,0]
["T - 20","Soundwave","15-06-2018","Southern Yellow Pine","3.81 Centimeter","18.415 Centimeter","3.81x18.415","3.658 Meter","12.832474335 Kg","658.21 Hz","11594.35 MPa","No. 2",0,0,0]
["T - 21","Soundwave","15-06-2018","Southern Yellow Pine","3.81 Centimeter","18.415 Centimeter","3.81x18.415","3.658 Meter","12.832474335 Kg","639.13 Hz","10931.90 MPa","No. 2",0,0,0]
["T - 22","Soundwave","15-06-2018","Southern Yellow Pine","3.81 Centimeter","18.415 Centimeter","3.81x18.415","3.658 Meter","12.832474335 Kg","711.29 Hz","13539.75 MPa","No. 1",0,0,0]
["T - 23","Soundwave","15-06-2018","Southern Yellow Pine","1.5 Inch","7.25 Inch","1.5x7.25","12.001 Feet","28.290033 lb","668.18 Hz","1.73 Mpsi","No. 2",0,0,0]
["T - 24","Soundwave","15-06-2018","Southern Yellow Pine","1.5 Inch","7.25 Inch","1.5x7.25","12.001 Feet","28.290033 lb","639.13 Hz","1.58 Mpsi","No. 2",0,0,0]
["T - 25","Soundwave","15-06-2018","Southern Yellow Pine","1.5 Inch","7.25 Inch","1.5x7.25","12.001 Feet","28.290033 lb","722.95 Hz","2.03 Mpsi","No. 1",0,0,0]
["T - 26","Soundwave","15-06-2018","Southern Yellow Pine","1.5 Inch","7.25 Inch","1.5x7.25","12.001 Feet","28.290033 lb","668.18 Hz","1.73 Mpsi","No. 2",0,0,0]
["T - 27","Soundwave","15-06-2018","Southern Yellow Pine","1.5 Inch","7.25 Inch","1.5x7.25","12.001 Feet","28.290033 lb","648.53 Hz","1.63 Mpsi","No. 2",0,0,0]
["T - 28","Soundwave","15-06-2018","Southern Yellow Pine","1.5 Inch","7.25 Inch","1.5x7.25","12.001 Feet","28.290033 lb","722.95 Hz","2.03 Mpsi","No. 1",0,0,0]
["x","Soundwave","15-06-2018","Southern Yellow Pine","1.5 Inch","7.25 Inch","1.5x7.25","12 Feet","28.287676 lb","668.18 Hz","1.73 Mpsi","No. 2",0,0,0]
["Y","Vibration","15-06-2018","Douglas-fir","1.5 Inch","7.2 Inch","1.5x7.2","12 Feet","29.77813 lb","6.45 Hz","1.92 Mpsi","No. 1",0,0,0]
["Y - 1","Vibration","15-06-2018","Douglas-fir","1.5 Inch","7.2 Inch","1.5x7.2","12 Feet","29.77813 lb","6.05 Hz","1.69 Mpsi","No. 2",0,0,0]
["Y - 2","Vibration","15-06-2018","Douglas-fir","1.5 Inch","7.2 Inch","1.5x7.2","12 Feet","29.77813 lb","6.64 Hz","2.04 Mpsi","No. 1",0,0,0]
["Y - 3","Soundwave","15-06-2018","Douglas-fir","1.5 Inch","7.2 Inch","1.5x7.2","12 Feet","29.77813 lb","658.21 Hz","1.78 Mpsi","No. 2",0,0,0]
["Y - 4","Soundwave","15-06-2018","Douglas-fir","1.5 Inch","7.2 Inch","1.5x7.2","12 Feet","29.77813 lb","639.13 Hz","1.68 Mpsi","No. 2",0,0,0]
["Y - 5","Soundwave","15-06-2018","Douglas-fir","1.5 Inch","7.2 Inch","1.5x7.2","12 Feet","29.77813 lb","735.00 Hz","2.22 Mpsi","No. 1",0,0,0]
["Y - 6","Vibration","15-06-2018","SPF (spruce pine fir)","3.81 Centimeter","18.288 Centimeter","3.81x18.288","3.658 Meter","11.4695770608 Kg","6.45 Hz","11264.27 MPa","No. 2",0,0,0]
["Y - 7","Vibration","15-06-2018","SPF (spruce pine fir)","3.81 Centimeter","18.288 Centimeter","3.81x18.288","3.658 Meter","11.4695770608 Kg","6.05 Hz","9910.47 MPa","No. 2",0,0,0]
["Y - 8","Vibration","15-06-2018","SPF (spruce pine fir)","3.81 Centimeter","18.288 Centimeter","3.81x18.288","3.658 Meter","11.4695770608 Kg","6.64 Hz","11937.67 MPa","No. 2",0,0,0]
["Y - 9","Vibration","15-06-2018","SPF (spruce pine fir)","1.5 Inch","7.2 Inch","1.5x7.2","12.001 Feet","25.285429 lb","6.45 Hz","1.63 Mpsi","No. 1",0,0,0]
["Y - 10","Vibration","15-06-2018","SPF (spruce pine fir)","1.5 Inch","7.2 Inch","1.5x7.2","12.001 Feet","25.285429 lb","6.05 Hz","1.44 Mpsi","No. 1",0,0,0]
["Y - 11","Vibration","15-06-2018","SPF (spruce pine fir)","1.5 Inch","7.2 Inch","1.5x7.2","12.001 Feet","25.285429 lb","6.64 Hz","1.73 Mpsi","No. 1",0,0,0]
["Y - 12","Soundwave","15-06-2018","SPF (spruce pine fir)","1.5 Inch","7.2 Inch","1.5x7.2","12.001 Feet","25.285429 lb","648.53 Hz","1.47 Mpsi","No. 1",0,0,0]
["Y - 13","Soundwave","15-06-2018","SPF (spruce pine fir)","1.5 Inch","7.2 Inch","1.5x7.2","12.001 Feet","25.285429 lb","639.13 Hz","1.43 Mpsi","No. 1",0,0,0]
["Y - 14","Soundwave","15-06-2018","SPF (spruce pine fir)","1.5 Inch","7.2 Inch","1.5x7.2","12.001 Feet","25.285429 lb","722.95 Hz","1.82 Mpsi","No. 1",0,0,0]

{"sheet":"Results Imperial","index":2,"n_rows":51,"n_cols":18,"rows_kept":51,"cut":false,"hidden":false,"merged":[]}
["Specimen","Test","Date","Species","Tested","Cross","Equivalent","Depth","Width","Length","Weight","Frequency","Stiffness","New Weight","Stiffness-psi","Current","Final","Stiffness-psi"]
["No.","Method",null,null,"Measure","Section","To","Inches","Inches","Feet","lbs",null,"psi","lbs","Wgt Adjusted","MC%","MC%","MC Adjusted"]
["a","Vibration","2018-12-06","SYP","Imperial","2x8","No. 3",2,8,12,41.618650000000002,6.05,0.89818350408664238,41.618650000000002,0.89818350408664238,0,15,0.89818350408664238]
["a - 1","Vibration","2018-12-06","SYP","Imperial","2x8","No. 3",2,8,12,41.618650000000002,6.25,0.95854909168456981,41.618650000000002,0.95854909168456981,0,15,0.95854909168456981]
["b","Vibration","2018-12-06","SYP","SI","5.08x20.32","No. 3",2.0000010800000001,8.0000043200000004,12.001318816666643,41.623142353548801,7.23,1.2832758999407081,41.623142353548801,1.2832758999407081,0,15,1.2832758999407081]
["b - 1","Vibration","2018-12-06","SYP","SI","5.08x20.32","No. 3",2.0000010800000001,8.0000043200000004,12.001318816666643,41.623142353548801,5.86,0.84302154832817677,41.623142353548801,0.84302154832817677,0,15,0.84302154832817677]
["T","Vibration","15-06-2018","SYP","Imperial","2x8","No. 1",1.5,7.25,12,28.287676000000001,6.45,1.8148938339901275,28.287676000000001,1.8148938339901275,0,15,1.8148938339901275]
["T - 1","Vibration","15-06-2018","SYP","Imperial","2x8","No. 2",1.5,7.25,12,28.287676000000001,6.05,1.596770664229882,28.287676000000001,1.596770664229882,0,15,1.596770664229882]
["T - 2","Vibration","15-06-2018","SYP","Imperial","2x8","No. 1",1.5,7.25,12,28.287676000000001,6.64,1.9233926610922689,28.287676000000001,1.9233926610922689,0,15,1.9233926610922689]
["T - 3","Vibration","15-06-2018","SYP","Imperial","2x8","No. 1",1.5,7.25,12,28.287676000000001,6.45,1.8148938339901275,28.287676000000001,1.8148938339901275,0,15,1.8148938339901275]
["T - 4","Vibration","15-06-2018","SYP","Imperial","2x8","No. 2",1.5,7.25,12,28.287676000000001,6.05,1.596770664229882,28.287676000000001,1.596770664229882,0,15,1.596770664229882]
["T - 5","Vibration","15-06-2018","SYP","Imperial","2x8","No. 1",1.5,7.25,12,28.287676000000001,6.64,1.9233926610922689,28.287676000000001,1.9233926610922689,0,15,1.9233926610922689]
["T - 6","Vibration","15-06-2018","SYP","SI","3.81x18.415","No. 1",1.5000008100000002,7.2500039149999997,12.001318816666643,28.2907295684277,6.45,1.8156843327922256,28.2907295684277,1.8156843327922256,0,15,1.8156843327922256]
["T - 7","Vibration","15-06-2018","SYP","SI","3.81x18.415","No. 2",1.5000008100000002,7.2500039149999997,12.001318816666643,28.2907295684277,6.05,1.5974661568662318,28.2907295684277,1.5974661568662318,0,15,1.5974661568662318]
["T - 8","Vibration","15-06-2018","SYP","SI","3.81x18.415","No. 1",1.5000008100000002,7.2500039149999997,12.001318816666643,28.2907295684277,6.64,1.9242304178613328,28.2907295684277,1.9242304178613328,0,15,1.9242304178613328]
["T - 9","Vibration","15-06-2018","SYP","SI","3.81x18.415","No. 1",1.5000008100000002,7.2500039149999997,12.001318816666643,28.2907295684277,6.45,1.8156843327922256,28.2907295684277,1.8156843327922256,0,15,1.8156843327922256]
["T - 10","Vibration","15-06-2018","SYP","SI","3.81x18.415","No. 2",1.5000008100000002,7.2500039149999997,12.001318816666643,28.2907295684277,6.05,1.5974661568662318,28.2907295684277,1.5974661568662318,0,15,1.5974661568662318]
["T - 11","Vibration","15-06-2018","SYP","SI","3.81x18.415","No. 1",1.5000008100000002,7.2500039149999997,12.001318816666643,28.2907295684277,6.64,1.9242304178613328,28.2907295684277,1.9242304178613328,0,15,1.9242304178613328]
["T - 12","Soundwave","15-06-2018","SYP","Imperial","2x8","No. 2",1.5,7.25,12.000999999999999,28.290033000000001,678.46,1.7869979444237298,28.290033000000001,1.7869979444237298,0,15,1.7869979444237298]
["T - 13","Soundwave","15-06-2018","SYP","Imperial","2x8","No. 2",1.5,7.25,12.000999999999999,28.290033000000001,658.21,1.6819168020856541,28.290033000000001,1.6819168020856541,0,15,1.6819168020856541]
["T - 14","Soundwave","15-06-2018","SYP","Imperial","2x8","No. 2",1.5,7.25,12.000999999999999,28.290033000000001,639.13,1.5858202654333382,28.290033000000001,1.5858202654333382,0,15,1.5858202654333382]
["T - 15","Soundwave","15-06-2018","SYP","Imperial","2x8","No. 1",1.5,7.25,12.000999999999999,28.290033000000001,722.95,2.0290468786806142,28.290033000000001,2.0290468786806142,0,15,2.0290468786806142]
["T - 16","Soundwave","15-06-2018","SYP","Imperial","2x8","No. 2",1.5,7.25,12.000999999999999,28.290033000000001,678.46,1.7869979444237298,28.290033000000001,1.7869979444237298,0,15,1.7869979444237298]
["T - 17","Soundwave","15-06-2018","SYP","Imperial","2x8","No. 2",1.5,7.25,12.000999999999999,28.290033000000001,648.53,1.6328101756712874,28.290033000000001,1.6328101756712874,0,15,1.6328101756712874]
["T - 18","Soundwave","15-06-2018","SYP","Imperial","2x8","No. 1",1.5,7.25,12.000999999999999,28.290033000000001,722.95,2.0290468786806142,28.290033000000001,2.0290468786806142,0,15,2.0290468786806142]
["T - 19","Soundwave","15-06-2018","SYP","SI","3.81x18.415","No. 2",1.5000008100000002,7.2500039149999997,12.001318816666643,28.2907295684277,668.18,1.7333420091264191,28.2907295684277,1.7333420091264191,0,15,1.7333420091264191]
["T - 20","Soundwave","15-06-2018","SYP","SI","3.81x18.415","No. 2",1.5000008100000002,7.2500039149999997,12.001318816666643,28.2907295684277,658.21,1.6820010809831969,28.2907295684277,1.6820010809831969,0,15,1.6820010809831969]
["T - 21","Soundwave","15-06-2018","SYP","SI","3.81x18.415","No. 2",1.5000008100000002,7.2500039149999997,12.001318816666643,28.2907295684277,639.13,1.5858997290450378,28.2907295684277,1.5858997290450378,0,15,1.5858997290450378]
["T - 22","Soundwave","15-06-2018","SYP","SI","3.81x18.415","No. 1",1.5000008100000002,7.2500039149999997,12.001318816666643,28.2907295684277,711.29,1.9642226936095071,28.2907295684277,1.9642226936095071,0,15,1.9642226936095071]
["T - 23","Soundwave","15-06-2018","SYP","Imperial","2x8","No. 2",1.5,7.25,12.000999999999999,28.290033000000001,668.18,1.7332551577235007,28.290033000000001,1.7332551577235007,0,15,1.7332551577235007]
["T - 24","Soundwave","15-06-2018","SYP","Imperial","2x8","No. 2",1.5,7.25,12.000999999999999,28.290033000000001,639.13,1.5858202654333382,28.290033000000001,1.5858202654333382,0,15,1.5858202654333382]
["T - 25","Soundwave","15-06-2018","SYP","Imperial","2x8","No. 1",1.5,7.25,12.000999999999999,28.290033000000001,722.95,2.0290468786806142,28.290033000000001,2.0290468786806142,0,15,2.0290468786806142]
["T - 26","Soundwave","15-06-2018","SYP","Imperial","2x8","No. 2",1.5,7.25,12.000999999999999,28.290033000000001,668.18,1.7332551577235007,28.290033000000001,1.7332551577235007,0,15,1.7332551577235007]
["T - 27","Soundwave","15-06-2018","SYP","Imperial","2x8","No. 2",1.5,7.25,12.000999999999999,28.290033000000001,648.53,1.6328101756712874,28.290033000000001,1.6328101756712874,0,15,1.6328101756712874]
["T - 28","Soundwave","15-06-2018","SYP","Imperial","2x8","No. 1",1.5,7.25,12.000999999999999,28.290033000000001,722.95,2.0290468786806142,28.290033000000001,2.0290468786806142,0,15,2.0290468786806142]
["x","Soundwave","15-06-2018","SYP","Imperial","2x8","No. 2",1.5,7.25,12,28.287676000000001,668.18,1.7329663367344523,28.287676000000001,1.7329663367344523,0,15,1.7329663367344523]
["Y","Vibration","15-06-2018","DF","Imperial","1.5x7.2","No. 1",1.5,7.2,12,29.778130000000001,6.45,1.9237865664169851,29.778130000000001,1.9237865664169851,0,15,1.9237865664169851]
["Y - 1","Vibration","15-06-2018","DF","Imperial","1.5x7.2","No. 2",1.5,7.2,12,29.778130000000001,6.05,1.6925761143507645,29.778130000000001,1.6925761143507645,0,15,1.6925761143507645]
["Y - 2","Vibration","15-06-2018","DF","Imperial","1.5x7.2","No. 1",1.5,7.2,12,29.778130000000001,6.64,2.0387952694837641,29.778130000000001,2.0387952694837641,0,15,2.0387952694837641]
["Y - 3","Soundwave","15-06-2018","DF","Imperial","1.5x7.2","No. 2",1.5,7.2,12,29.778130000000001,658.21,1.7825338963098214,29.778130000000001,1.7825338963098214,0,15,1.7825338963098214]
["Y - 4","Soundwave","15-06-2018","DF","Imperial","1.5x7.2","No. 2",1.5,7.2,12,29.778130000000001,639.13,1.6806885888080958,29.778130000000001,1.6806885888080958,0,15,1.6806885888080958]
["Y - 5","Soundwave","15-06-2018","DF","Imperial","1.5x7.2","No. 1",1.5,7.2,12,29.778130000000001,735,2.2227136827979268,29.778130000000001,2.2227136827979268,0,15,2.2227136827979268]
["Y - 6","Vibration","15-06-2018","SPF","SI","3.81x18.288","No. 2",1.5000008100000002,7.2000038880000004,12.001318816666643,25.286058979780897,6.45,1.6341158995130027,25.286058979780897,1.6341158995130027,0,15,1.6341158995130027]
["Y - 7","Vibration","15-06-2018","SPF","SI","3.81x18.288","No. 2",1.5000008100000002,7.2000038880000004,12.001318816666643,25.286058979780897,6.05,1.4377195411796095,25.286058979780897,1.4377195411796095,0,15,1.4377195411796095]
["Y - 8","Vibration","15-06-2018","SPF","SI","3.81x18.288","No. 2",1.5000008100000002,7.2000038880000004,12.001318816666643,25.286058979780897,6.64,1.7318073760751995,25.286058979780897,1.7318073760751995,0,15,1.7318073760751995]
["Y - 9","Vibration","15-06-2018","SPF","Imperial","1.5x7.2","No. 1",1.5,7.2,12.000999999999999,25.285429000000001,6.45,1.6339484914562976,25.285429000000001,1.6339484914562976,0,15,1.6339484914562976]
["Y - 10","Vibration","15-06-2018","SPF","Imperial","1.5x7.2","No. 1",1.5,7.2,12.000999999999999,25.285429000000001,6.05,1.4375722530744341,25.285429000000001,1.4375722530744341,0,15,1.4375722530744341]
["Y - 11","Vibration","15-06-2018","SPF","Imperial","1.5x7.2","No. 1",1.5,7.2,12.000999999999999,25.285429000000001,6.64,1.7316299599522043,25.285429000000001,1.7316299599522043,0,15,1.7316299599522043]
["Y - 12","Soundwave","15-06-2018","SPF","Imperial","1.5x7.2","No. 1",1.5,7.2,12.000999999999999,25.285429000000001,648.53,1.4695287285148104,25.285429000000001,1.4695287285148104,0,15,1.4695287285148104]
["Y - 13","Soundwave","15-06-2018","SPF","Imperial","1.5x7.2","No. 1",1.5,7.2,12.000999999999999,25.285429000000001,639.13,1.4272378216636146,25.285429000000001,1.4272378216636146,0,15,1.4272378216636146]
["Y - 14","Soundwave","15-06-2018","SPF","Imperial","1.5x7.2","No. 1",1.5,7.2,12.000999999999999,25.285429000000001,722.95,1.8261416569740576,25.285429000000001,1.8261416569740576,0,15,1.8261416569740576]

{"sheet":"Results SI","index":3,"n_rows":51,"n_cols":18,"rows_kept":51,"cut":false,"hidden":false,"merged":[]}
["Specimen","Test","Date","Species","Cross","Equivalent","Tested","Depth","Width","Length","Weight","Frequency","Stiffness","New Weight","Stiffness-Mpa","Current","Final","Stiffness-Mpa"]
["No.","Method",null,null,"Section","To","Measure","CM","CM","Meters","Kg",null,"Mpa","Kg","Wgt Adjusted","MC%","MC%","MC Adjusted"]
["a","Vibration",43440,"SYP","2x8","No. 3","Imperial",5.0800027431999997,20.320010972799999,3.6576000000000004,18.8778866908,6.05,6192.759696636419,18.8778866908,6192.759696636419,0,15,6192.759696636419]
["a - 1","Vibration",43440,"SYP","2x8","No. 3","Imperial",5.0800027431999997,20.320010972799999,3.6576000000000004,18.8778866908,6.25,6608.9659353831048,18.8778866908,6608.9659353831048,0,15,6608.9659353831048]
["b","Vibration",43440,"SYP","5.08x20.32","No. 3","SI",5.0800054864014816,20.320021945605927,3.6580019753199928,18.879924386430908,7.23,8847.8793438751964,18.879924386430908,8847.8793438751964,0,15,8847.8793438751964]
["b - 1","Vibration",43440,"SYP","5.08x20.32","No. 3","SI",5.0800054864014816,20.320021945605927,3.6580019753199928,18.879924386430908,5.86,5812.4312505511807,18.879924386430908,5812.4312505511807,0,15,5812.4312505511807]
["T","Vibration","15-06-2018","SYP","2x8","No. 1","Imperial",3.8100020573999998,18.415009944099999,3.6576000000000004,12.831063532192001,6.45,12513.257410841772,12.831063532192001,12513.257410841772,0,15,12513.257410841772]
["T - 1","Vibration","15-06-2018","SYP","2x8","No. 2","Imperial",3.8100020573999998,18.415009944099999,3.6576000000000004,12.831063532192001,6.05,11009.350504905622,12.831063532192001,11009.350504905622,0,15,11009.350504905622]
["T - 2","Vibration","15-06-2018","SYP","2x8","No. 1","Imperial",3.8100020573999998,18.415009944099999,3.6576000000000004,12.831063532192001,6.64,13261.330783992533,12.831063532192001,13261.330783992533,0,15,13261.330783992533]
["T - 3","Vibration","15-06-2018","SYP","2x8","No. 1","Imperial",3.8100020573999998,18.415009944099999,3.6576000000000004,12.831063532192001,6.45,12513.257410841772,12.831063532192001,12513.257410841772,0,15,12513.257410841772]
["T - 4","Vibration","15-06-2018","SYP","2x8","No. 2","Imperial",3.8100020573999998,18.415009944099999,3.6576000000000004,12.831063532192001,6.05,11009.350504905622,12.831063532192001,11009.350504905622,0,15,11009.350504905622]
["T - 5","Vibration","15-06-2018","SYP","2x8","No. 1","Imperial",3.8100020573999998,18.415009944099999,3.6576000000000004,12.831063532192001,6.64,13261.330783992533,12.831063532192001,13261.330783992533,0,15,13261.330783992533]
["T - 6","Vibration","15-06-2018","SYP","3.81x18.415","No. 1","SI",3.810004114801111,18.415019888205368,3.6580019753199928,12.832448606402258,6.45,12518.707710362525,12.832448606402258,12518.707710362525,0,15,12518.707710362525]
["T - 7","Vibration","15-06-2018","SYP","3.81x18.415","No. 2","SI",3.810004114801111,18.415019888205368,3.6580019753199928,12.832448606402258,6.05,11014.14575971502,12.832448606402258,11014.14575971502,0,15,11014.14575971502]
["T - 8","Vibration","15-06-2018","SYP","3.81x18.415","No. 1","SI",3.810004114801111,18.415019888205368,3.6580019753199928,12.832448606402258,6.64,13267.106915853603,12.832448606402258,13267.106915853603,0,15,13267.106915853603]
["T - 9","Vibration","15-06-2018","SYP","3.81x18.415","No. 1","SI",3.810004114801111,18.415019888205368,3.6580019753199928,12.832448606402258,6.45,12518.707710362525,12.832448606402258,12518.707710362525,0,15,12518.707710362525]
["T - 10","Vibration","15-06-2018","SYP","3.81x18.415","No. 2","SI",3.810004114801111,18.415019888205368,3.6580019753199928,12.832448606402258,6.05,11014.14575971502,12.832448606402258,11014.14575971502,0,15,11014.14575971502]
["T - 11","Vibration","15-06-2018","SYP","3.81x18.415","No. 1","SI",3.810004114801111,18.415019888205368,3.6580019753199928,12.832448606402258,6.64,13267.106915853603,12.832448606402258,13267.106915853603,0,15,13267.106915853603]
["T - 12","Soundwave","15-06-2018","SYP","2x8","No. 2","Imperial",3.8100020573999998,18.415009944099999,3.6579047999999998,12.832132648536,678.46,12320.921947294955,12.832132648536,12320.921947294955,0,15,12320.921947294955]
["T - 13","Soundwave","15-06-2018","SYP","2x8","No. 2","Imperial",3.8100020573999998,18.415009944099999,3.6579047999999998,12.832132648536,658.21,11596.412690348085,12.832132648536,11596.412690348085,0,15,11596.412690348085]
["T - 14","Soundwave","15-06-2018","SYP","2x8","No. 2","Imperial",3.8100020573999998,18.415009944099999,3.6579047999999998,12.832132648536,639.13,10933.850133299164,12.832132648536,10933.850133299164,0,15,10933.850133299164]
["T - 15","Soundwave","15-06-2018","SYP","2x8","No. 1","Imperial",3.8100020573999998,18.415009944099999,3.6579047999999998,12.832132648536,722.95,13989.791257251953,12.832132648536,13989.791257251953,0,15,13989.791257251953]
["T - 16","Soundwave","15-06-2018","SYP","2x8","No. 2","Imperial",3.8100020573999998,18.415009944099999,3.6579047999999998,12.832132648536,678.46,12320.921947294955,12.832132648536,12320.921947294955,0,15,12320.921947294955]
["T - 17","Soundwave","15-06-2018","SYP","2x8","No. 2","Imperial",3.8100020573999998,18.415009944099999,3.6579047999999998,12.832132648536,648.53,11257.834286811365,12.832132648536,11257.834286811365,0,15,11257.834286811365]
["T - 18","Soundwave","15-06-2018","SYP","2x8","No. 1","Imperial",3.8100020573999998,18.415009944099999,3.6579047999999998,12.832132648536,722.95,13989.791257251953,12.832132648536,13989.791257251953,0,15,13989.791257251953]
["T - 19","Soundwave","15-06-2018","SYP","3.81x18.415","No. 2","SI",3.810004114801111,18.415019888205368,3.6580019753199928,12.832448606402258,668.18,11950.97715084447,12.832448606402258,11950.97715084447,0,15,11950.97715084447]
["T - 20","Soundwave","15-06-2018","SYP","3.81x18.415","No. 2","SI",3.810004114801111,18.415019888205368,3.6580019753199928,12.832448606402258,658.21,11596.993773119708,12.832448606402258,11596.993773119708,0,15,11596.993773119708]
["T - 21","Soundwave","15-06-2018","SYP","3.81x18.415","No. 2","SI",3.810004114801111,18.415019888205368,3.6580019753199928,12.832448606402258,639.13,10934.398015830566,12.832448606402258,10934.398015830566,0,15,10934.398015830566]
["T - 22","Soundwave","15-06-2018","SYP","3.81x18.415","No. 1","SI",3.810004114801111,18.415019888205368,3.6580019753199928,12.832448606402258,711.29,13542.844058991086,12.832448606402258,13542.844058991086,0,15,13542.844058991086]
["T - 23","Soundwave","15-06-2018","SYP","2x8","No. 2","Imperial",3.8100020573999998,18.415009944099999,3.6579047999999998,12.832132648536,668.18,11950.378331265683,12.832132648536,11950.378331265683,0,15,11950.378331265683]
["T - 24","Soundwave","15-06-2018","SYP","2x8","No. 2","Imperial",3.8100020573999998,18.415009944099999,3.6579047999999998,12.832132648536,639.13,10933.850133299164,12.832132648536,10933.850133299164,0,15,10933.850133299164]
["T - 25","Soundwave","15-06-2018","SYP","2x8","No. 1","Imperial",3.8100020573999998,18.415009944099999,3.6579047999999998,12.832132648536,722.95,13989.791257251953,12.832132648536,13989.791257251953,0,15,13989.791257251953]
["T - 26","Soundwave","15-06-2018","SYP","2x8","No. 2","Imperial",3.8100020573999998,18.415009944099999,3.6579047999999998,12.832132648536,668.18,11950.378331265683,12.832132648536,11950.378331265683,0,15,11950.378331265683]
["T - 27","Soundwave","15-06-2018","SYP","2x8","No. 2","Imperial",3.8100020573999998,18.415009944099999,3.6579047999999998,12.832132648536,648.53,11257.834286811365,12.832132648536,11257.834286811365,0,15,11257.834286811365]
["T - 28","Soundwave","15-06-2018","SYP","2x8","No. 1","Imperial",3.8100020573999998,18.415009944099999,3.6579047999999998,12.832132648536,722.95,13989.791257251953,12.832132648536,13989.791257251953,0,15,13989.791257251953]
["x","Soundwave","15-06-2018","SYP","2x8","No. 2","Imperial",3.8100020573999998,18.415009944099999,3.6576000000000004,12.831063532192001,668.18,11948.386979863233,12.831063532192001,11948.386979863233,0,15,11948.386979863233]
["Y","Vibration","15-06-2018","DF","1.5x7.2","No. 1","Imperial",3.8100020573999998,18.28800987552,3.6576000000000004,13.50712154296,6.45,13264.046666669172,13.50712154296,13264.046666669172,0,15,13264.046666669172]
["Y - 1","Vibration","15-06-2018","DF","1.5x7.2","No. 2","Imperial",3.8100020573999998,18.28800987552,3.6576000000000004,13.50712154296,6.05,11669.906090181077,13.50712154296,11669.906090181077,0,15,11669.906090181077]
["Y - 2","Vibration","15-06-2018","DF","1.5x7.2","No. 1","Imperial",3.8100020573999998,18.28800987552,3.6576000000000004,13.50712154296,6.64,14057.004072225878,13.50712154296,14057.004072225878,0,15,14057.004072225878]
["Y - 3","Soundwave","15-06-2018","DF","1.5x7.2","No. 2","Imperial",3.8100020573999998,18.28800987552,3.6576000000000004,13.50712154296,658.21,12290.143406921105,13.50712154296,12290.143406921105,0,15,12290.143406921105]
["Y - 4","Soundwave","15-06-2018","DF","1.5x7.2","No. 2","Imperial",3.8100020573999998,18.28800987552,3.6576000000000004,13.50712154296,639.13,11587.944454570506,13.50712154296,11587.944454570506,0,15,11587.944454570506]
["Y - 5","Soundwave","15-06-2018","DF","1.5x7.2","No. 1","Imperial",3.8100020573999998,18.28800987552,3.6576000000000004,13.50712154296,735,15325.077391607834,13.50712154296,15325.077391607834,0,15,15325.077391607834]
["Y - 6","Vibration","15-06-2018","SPF","3.81x18.288","No. 2","SI",3.810004114801111,18.288019751045333,3.6580019753199928,11.469554064756776,6.45,11266.836939326271,11.469554064756776,11266.836939326271,0,15,11266.836939326271]
["Y - 7","Vibration","15-06-2018","SPF","3.81x18.288","No. 2","SI",3.810004114801111,18.288019751045333,3.6580019753199928,11.469554064756776,6.05,9912.7311837435245,11.469554064756776,9912.7311837435245,0,15,9912.7311837435245]
["Y - 8","Vibration","15-06-2018","SPF","3.81x18.288","No. 2","SI",3.810004114801111,18.288019751045333,3.6580019753199928,11.469554064756776,6.64,11940.396224268243,11.469554064756776,11940.396224268243,0,15,11940.396224268243]
["Y - 9","Vibration","15-06-2018","SPF","1.5x7.2","No. 1","Imperial",3.8100020573999998,18.28800987552,3.6579047999999998,11.469268310967999,6.45,11265.682700953223,11.469268310967999,11265.682700953223,0,15,11265.682700953223]
["Y - 10","Vibration","15-06-2018","SPF","1.5x7.2","No. 1","Imperial",3.8100020573999998,18.28800987552,3.6579047999999998,11.469268310967999,6.05,9911.7156676074865,11.469268310967999,9911.7156676074865,0,15,9911.7156676074865]
["Y - 11","Vibration","15-06-2018","SPF","1.5x7.2","No. 1","Imperial",3.8100020573999998,18.28800987552,3.6579047999999998,11.469268310967999,6.64,11939.17298268006,11.469268310967999,11939.17298268006,0,15,11939.17298268006]
["Y - 12","Soundwave","15-06-2018","SPF","1.5x7.2","No. 1","Imperial",3.8100020573999998,18.28800987552,3.6579047999999998,11.469268310967999,648.53,10132.047896214775,11.469268310967999,10132.047896214775,0,15,10132.047896214775]
["Y - 13","Soundwave","15-06-2018","SPF","1.5x7.2","No. 1","Imperial",3.8100020573999998,18.28800987552,3.6579047999999998,11.469268310967999,639.13,9840.4622432934229,11.469268310967999,9840.4622432934229,0,15,9840.4622432934229]
["Y - 14","Soundwave","15-06-2018","SPF","1.5x7.2","No. 1","Imperial",3.8100020573999998,18.28800987552,3.6579047999999998,11.469268310967999,722.95,12590.808450838455,11.469268310967999,12590.808450838455,0,15,12590.808450838455]

{"sheet":"Calcs","index":4,"n_rows":51,"n_cols":37,"rows_kept":51,"cut":false,"hidden":true,"merged":[]}
["Specimen","Test",{"$f":"Input!C1","v":"Date"},"Species","Tested","Cross","Equivalent","Depth","Width","Length","Weight","Frequency","Stiffness","New Weight","Stiffness-psi","Current","Final","Stiffness-psi",null,"Specimen","Test",{"$f":"C1","v":"Date"},"Species","Cross","Equivalent","Tested","Depth","Width","Length","Weight",{"$f":"L1","v":"Frequency"},"Stiffness","New Weight","Stiffness-Mpa",{"$f":"P1","v":"Current"},{"$f":"Q1","v":"Final"},"Stiffness-Mpa"]
["No.","Method",null,null,"Measure","Section","To","Inches","Inches","Feet","lbs",null,"psi","lbs","Wgt Adjusted","MC%","MC%","MC Adjusted",null,"No.","Method",null,null,"Section","To","Measure","CM","CM","Meters","Kg",null,"Mpa","Kg","Wgt Adjusted","MC%","MC%","MC Adjusted"]
[{"$f":"Input!A3","v":"a"},{"$f":"Input!B3","v":"Vibration"},{"$f":"Input!C3","v":"2018-12-06"},{"$f":"IF(Input!D3=\"Southern Yellow Pine\",\"SYP\",IF(Input!D3=\"Douglas-fir\",\"DF\",IF(Input!D3=\"SPF (spruce pine fir)\",\"SPF\",\"Other\")))","v":"SYP"},{"$f":"IF(RIGHT(Input!E3,4)=\"inch\",\"Imperial\",\"SI\")","v":"Imperial"},{"$f":"IF(E3=\"Imperial\",IF(Input!G3=\"1.5x3.5\",\"2x4\",IF(Input!G3=\"1.5x5.5\",\"2x6\",IF(Input!G3=\"1.5x7.25\",\"2x8\",IF(Input!G3=\"1.5x9.25\",\"2x10\",IF(Input!G3=\"1.5x11.25\",\"2x12\",Input!G3))))),Input!G3)","v":"2x8"},{"$f":"Input!L3","v":"No. 3"},{"$f":"IF(RIGHT(Input!E3,4)=\"inch\",VALUE(LEFT(Input!E3,LEN(Input!E3)-4)),VALUE(LEFT(Input!E3,LEN(Input!E3)-10))*0.393701)","v":2},{"$f":"IF(RIGHT(Input!F3,4)=\"inch\",VALUE(LEFT(Input!F3,LEN(Input!F3)-4)),VALUE(LEFT(Input!F3,LEN(Input!F3)-10))*0.393701)","v":8},{"$f":"IF(RIGHT(Input!H3,4)=\"Feet\",VALUE(LEFT(Input!H3,LEN(Input!H3)-4)),VALUE(LEFT(Input!H3,LEN(Input!H3)-5))*3.28084166666666)","v":12},{"$f":"IF(RIGHT(Input!I3,2)=\"LB\",VALUE(LEFT(Input!I3,LEN(Input!I3)-2)),VALUE(LEFT(Input!I3,LEN(Input!I3)-2))*2.20462)","v":41.618650000000002},{"$f":"VALUE(LEFT(Input!J3,LEN(Input!J3)-3))","v":6.05},{"$f":"IF(B3=\"vibration\",(L3^2*K3*J3^3*1728)/(2.46*I3*H3^3/12)/386/1000000,(K3/(H3*I3*J3*12))*4*J3*J3*12*12*L3*L3/386/1000000)","v":0.89818350408664238},{"$f":"IF(Input!M3>0,Input!M3,IF(Input!N3>0,Input!N3*2.20462,K3))","v":41.618650000000002},{"$f":"IF(B3=\"vibration\",(L3^2*N3*J3^3*1728)/(2.46*I3*H3^3/12)/386/1000000,(N3/(H3*I3*J3*12))*4*J3*J3*12*12*L3*L3/386/1000000)","v":0.89818350408664238},{"$f":"Input!O3","v":0},{"$f":"Menu!V$11","v":15},{"$f":"IF(Input!O3>0,O3*(1.857-(0.0237*Menu!V$11))/(1.857-(0.0237*Input!O3)),O3)","v":0.89818350408664238},null,{"$f":"A3","v":"a"},"Vibration","2018-12-06","SYP",{"$f":"F3","v":"2x8"},"No. 3",{"$f":"E3","v":"Imperial"},{"$f":"H3*2.5400013716","v":5.0800027431999997},{"$f":"(I3*2.5400013716)","v":20.320010972799999},{"$f":"(J3*0.3048)","v":3.6576000000000004},{"$f":"(K3*0.453592)","v":18.8778866908},{"$f":"L3","v":6.05},{"$f":"M3*6894.76","v":6192.759696636419},{"$f":"(N3*0.453592)","v":18.8778866908},{"$f":"O3*6894.76","v":6192.759696636419},0,15,{"$f":"R3*6894.76","v":6192.759696636419}]
[{"$f":"Input!A4","v":"a - 1"},{"$f":"Input!B4","v":"Vibration"},{"$f":"Input!C4","v":"2018-12-06"},{"$f":"IF(Input!D4=\"Southern Yellow Pine\",\"SYP\",IF(Input!D4=\"Douglas-fir\",\"DF\",IF(Input!D4=\"SPF (spruce pine fir)\",\"SPF\",\"Other\")))","v":"SYP"},{"$f":"IF(RIGHT(Input!E4,4)=\"inch\",\"Imperial\",\"SI\")","v":"Imperial"},{"$f":"IF(E4=\"Imperial\",IF(Input!G4=\"1.5x3.5\",\"2x4\",IF(Input!G4=\"1.5x5.5\",\"2x6\",IF(Input!G4=\"1.5x7.25\",\"2x8\",IF(Input!G4=\"1.5x9.25\",\"2x10\",IF(Input!G4=\"1.5x11.25\",\"2x12\",Input!G4))))),Input!G4)","v":"2x8"},{"$f":"Input!L4","v":"No. 3"},{"$f":"IF(RIGHT(Input!E4,4)=\"inch\",VALUE(LEFT(Input!E4,LEN(Input!E4)-4)),VALUE(LEFT(Input!E4,LEN(Input!E4)-10))*0.393701)","v":2},{"$f":"IF(RIGHT(Input!F4,4)=\"inch\",VALUE(LEFT(Input!F4,LEN(Input!F4)-4)),VALUE(LEFT(Input!F4,LEN(Input!F4)-10))*0.393701)","v":8},{"$f":"IF(RIGHT(Input!H4,4)=\"Feet\",VALUE(LEFT(Input!H4,LEN(Input!H4)-4)),VALUE(LEFT(Input!H4,LEN(Input!H4)-5))*3.28084166666666)","v":12},{"$f":"IF(RIGHT(Input!I4,2)=\"LB\",VALUE(LEFT(Input!I4,LEN(Input!I4)-2)),VALUE(LEFT(Input!I4,LEN(Input!I4)-2))*2.20462)","v":41.618650000000002},{"$f":"VALUE(LEFT(Input!J4,LEN(Input!J4)-3))","v":6.25},{"$f":"IF(B4=\"vibration\",(L4^2*K4*J4^3*1728)/(2.46*I4*H4^3/12)/386/1000000,(K4/(H4*I4*J4*12))*4*J4*J4*12*12*L4*L4/386/1000000)","v":0.95854909168456981},{"$f":"IF(Input!M4>0,Input!M4,IF(Input!N4>0,Input!N4*2.20462,K4))","v":41.618650000000002},{"$f":"IF(B4=\"vibration\",(L4^2*N4*J4^3*1728)/(2.46*I4*H4^3/12)/386/1000000,(N4/(H4*I4*J4*12))*4*J4*J4*12*12*L4*L4/386/1000000)","v":0.95854909168456981},{"$f":"Input!O4","v":0},{"$f":"Menu!V$11","v":15},{"$f":"IF(Input!O4>0,O4*(1.857-(0.0237*Menu!V$11))/(1.857-(0.0237*Input!O4)),O4)","v":0.95854909168456981},null,{"$f":"A4","v":"a - 1"},{"$f":"B4","v":"Vibration"},{"$f":"C4","v":"2018-12-06"},{"$f":"D4","v":"SYP"},{"$f":"F4","v":"2x8"},{"$f":"G4","v":"No. 3"},{"$f":"E4","v":"Imperial"},{"$f":"H4*2.5400013716","v":5.0800027431999997},{"$f":"(I4*2.5400013716)","v":20.320010972799999},{"$f":"(J4*0.3048)","v":3.6576000000000004},{"$f":"(K4*0.453592)","v":18.8778866908},{"$f":"L4","v":6.25},{"$f":"M4*6894.76","v":6608.9659353831048},{"$f":"(N4*0.453592)","v":18.8778866908},{"$f":"O4*6894.76","v":6608.9659353831048},{"$f":"P4","v":0},{"$f":"Q4","v":15},{"$f":"R4*6894.76","v":6608.9659353831048}]
[{"$f":"Input!A5","v":"b"},{"$f":"Input!B5","v":"Vibration"},{"$f":"Input!C5","v":"2018-12-06"},{"$f":"IF(Input!D5=\"Southern Yellow Pine\",\"SYP\",IF(Input!D5=\"Douglas-fir\",\"DF\",IF(Input!D5=\"SPF (spruce pine fir)\",\"SPF\",\"Other\")))","v":"SYP"},{"$f":"IF(RIGHT(Input!E5,4)=\"inch\",\"Imperial\",\"SI\")","v":"SI"},{"$f":"IF(E5=\"Imperial\",IF(Input!G5=\"1.5x3.5\",\"2x4\",IF(Input!G5=\"1.5x5.5\",\"2x6\",IF(Input!G5=\"1.5x7.25\",\"2x8\",IF(Input!G5=\"1.5x9.25\",\"2x10\",IF(Input!G5=\"1.5x11.25\",\"2x12\",Input!G5))))),Input!G5)","v":"5.08x20.32"},{"$f":"Input!L5","v":"No. 3"},{"$f":"IF(RIGHT(Input!E5,4)=\"inch\",VALUE(LEFT(Input!E5,LEN(Input!E5)-4)),VALUE(LEFT(Input!E5,LEN(Input!E5)-10))*0.393701)","v":2.0000010800000001},{"$f":"IF(RIGHT(Input!F5,4)=\"inch\",VALUE(LEFT(Input!F5,LEN(Input!F5)-4)),VALUE(LEFT(Input!F5,LEN(Input!F5)-10))*0.393701)","v":8.0000043200000004},{"$f":"IF(RIGHT(Input!H5,4)=\"Feet\",VALUE(LEFT(Input!H5,LEN(Input!H5)-4)),VALUE(LEFT(Input!H5,LEN(Input!H5)-5))*3.28084166666666)","v":12.001318816666643},{"$f":"IF(RIGHT(Input!I5,2)=\"LB\",VALUE(LEFT(Input!I5,LEN(Input!I5)-2)),VALUE(LEFT(Input!I5,LEN(Input!I5)-2))*2.20462)","v":41.623142353548801},{"$f":"VALUE(LEFT(Input!J5,LEN(Input!J5)-3))","v":7.23},1.2832758999407081,{"$f":"IF(Input!M5>0,Input!M5,IF(Input!N5>0,Input!N5*2.20462,K5))","v":41.623142353548801},1.2832758999407081,{"$f":"Input!O5","v":0},{"$f":"Menu!V$11","v":15},{"$f":"IF(Input!O5>0,O5*(1.857-(0.0237*Menu!V$11))/(1.857-(0.0237*Input!O5)),O5)","v":1.2832758999407081},null,"b","Vibration","2018-12-06","SYP","5.08x20.32","No. 3","SI",5.0800054864014816,20.320021945605927,3.6580019753199928,18.879924386430908,7.23,8847.8793438751964,18.879924386430908,8847.8793438751964,0,15,8847.8793438751964]
[{"$f":"Input!A6","v":"b - 1"},{"$f":"Input!B6","v":"Vibration"},{"$f":"Input!C6","v":"2018-12-06"},{"$f":"IF(Input!D6=\"Southern Yellow Pine\",\"SYP\",IF(Input!D6=\"Douglas-fir\",\"DF\",IF(Input!D6=\"SPF (spruce pine fir)\",\"SPF\",\"Other\")))","v":"SYP"},{"$f":"IF(RIGHT(Input!E6,4)=\"inch\",\"Imperial\",\"SI\")","v":"SI"},{"$f":"IF(E6=\"Imperial\",IF(Input!G6=\"1.5x3.5\",\"2x4\",IF(Input!G6=\"1.5x5.5\",\"2x6\",IF(Input!G6=\"1.5x7.25\",\"2x8\",IF(Input!G6=\"1.5x9.25\",\"2x10\",IF(Input!G6=\"1.5x11.25\",\"2x12\",Input!G6))))),Input!G6)","v":"5.08x20.32"},{"$f":"Input!L6","v":"No. 3"},{"$f":"IF(RIGHT(Input!E6,4)=\"inch\",VALUE(LEFT(Input!E6,LEN(Input!E6)-4)),VALUE(LEFT(Input!E6,LEN(Input!E6)-10))*0.393701)","v":2.0000010800000001},{"$f":"IF(RIGHT(Input!F6,4)=\"inch\",VALUE(LEFT(Input!F6,LEN(Input!F6)-4)),VALUE(LEFT(Input!F6,LEN(Input!F6)-10))*0.393701)","v":8.0000043200000004},{"$f":"IF(RIGHT(Input!H6,4)=\"Feet\",VALUE(LEFT(Input!H6,LEN(Input!H6)-4)),VALUE(LEFT(Input!H6,LEN(Input!H6)-5))*3.28084166666666)","v":12.001318816666643},{"$f":"IF(RIGHT(Input!I6,2)=\"LB\",VALUE(LEFT(Input!I6,LEN(Input!I6)-2)),VALUE(LEFT(Input!I6,LEN(Input!I6)-2))*2.20462)","v":41.623142353548801},{"$f":"VALUE(LEFT(Input!J6,LEN(Input!J6)-3))","v":5.86},0.84302154832817677,{"$f":"IF(Input!M6>0,Input!M6,IF(Input!N6>0,Input!N6*2.20462,K6))","v":41.623142353548801},0.84302154832817677,{"$f":"Input!O6","v":0},{"$f":"Menu!V$11","v":15},{"$f":"IF(Input!O6>0,O6*(1.857-(0.0237*Menu!V$11))/(1.857-(0.0237*Input!O6)),O6)","v":0.84302154832817677},null,"b - 1","Vibration","2018-12-06","SYP","5.08x20.32","No. 3","SI",5.0800054864014816,20.320021945605927,3.6580019753199928,18.879924386430908,5.86,5812.4312505511807,18.879924386430908,5812.4312505511807,0,15,5812.4312505511807]
[{"$f":"Input!A7","v":"T"},{"$f":"Input!B7","v":"Vibration"},{"$f":"Input!C7","v":"15-06-2018"},{"$f":"IF(Input!D7=\"Southern Yellow Pine\",\"SYP\",IF(Input!D7=\"Douglas-fir\",\"DF\",IF(Input!D7=\"SPF (spruce pine fir)\",\"SPF\",\"Other\")))","v":"SYP"},{"$f":"IF(RIGHT(Input!E7,4)=\"inch\",\"Imperial\",\"SI\")","v":"Imperial"},{"$f":"IF(E7=\"Imperial\",IF(Input!G7=\"1.5x3.5\",\"2x4\",IF(Input!G7=\"1.5x5.5\",\"2x6\",IF(Input!G7=\"1.5x7.25\",\"2x8\",IF(Input!G7=\"1.5x9.25\",\"2x10\",IF(Input!G7=\"1.5x11.25\",\"2x12\",Input!G7))))),Input!G7)","v":"2x8"},{"$f":"Input!L7","v":"No. 1"},{"$f":"IF(RIGHT(Input!E7,4)=\"inch\",VALUE(LEFT(Input!E7,LEN(Input!E7)-4)),VALUE(LEFT(Input!E7,LEN(Input!E7)-10))*0.393701)","v":1.5},{"$f":"IF(RIGHT(Input!F7,4)=\"inch\",VALUE(LEFT(Input!F7,LEN(Input!F7)-4)),VALUE(LEFT(Input!F7,LEN(Input!F7)-10))*0.393701)","v":7.25},{"$f":"IF(RIGHT(Input!H7,4)=\"Feet\",VALUE(LEFT(Input!H7,LEN(Input!H7)-4)),VALUE(LEFT(Input!H7,LEN(Input!H7)-5))*3.28084166666666)","v":12},{"$f":"IF(RIGHT(Input!I7,2)=\"LB\",VALUE(LEFT(Input!I7,LEN(Input!I7)-2)),VALUE(LEFT(Input!I7,LEN(Input!I7)-2))*2.20462)","v":28.287676000000001},{"$f":"VALUE(LEFT(Input!J7,LEN(Input!J7)-3))","v":6.45},1.8148938339901275,{"$f":"IF(Input!M7>0,Input!M7,IF(Input!N7>0,Input!N7*2.20462,K7))","v":28.287676000000001},1.8148938339901275,{"$f":"Input!O7","v":0},{"$f":"Menu!V$11","v":15},{"$f":"IF(Input!O7>0,O7*(1.857-(0.0237*Menu!V$11))/(1.857-(0.0237*Input!O7)),O7)","v":1.8148938339901275},null,"T","Vibration","15-06-2018","SYP","2x8","No. 1","Imperial",3.8100020573999998,18.415009944099999,3.6576000000000004,12.831063532192001,6.45,12513.257410841772,12.831063532192001,12513.257410841772,0,15,12513.257410841772]
[{"$f":"Input!A8","v":"T - 1"},{"$f":"Input!B8","v":"Vibration"},{"$f":"Input!C8","v":"15-06-2018"},{"$f":"IF(Input!D8=\"Southern Yellow Pine\",\"SYP\",IF(Input!D8=\"Douglas-fir\",\"DF\",IF(Input!D8=\"SPF (spruce pine fir)\",\"SPF\",\"Other\")))","v":"SYP"},{"$f":"IF(RIGHT(Input!E8,4)=\"inch\",\"Imperial\",\"SI\")","v":"Imperial"},{"$f":"IF(E8=\"Imperial\",IF(Input!G8=\"1.5x3.5\",\"2x4\",IF(Input!G8=\"1.5x5.5\",\"2x6\",IF(Input!G8=\"1.5x7.25\",\"2x8\",IF(Input!G8=\"1.5x9.25\",\"2x10\",IF(Input!G8=\"1.5x11.25\",\"2x12\",Input!G8))))),Input!G8)","v":"2x8"},{"$f":"Input!L8","v":"No. 2"},{"$f":"IF(RIGHT(Input!E8,4)=\"inch\",VALUE(LEFT(Input!E8,LEN(Input!E8)-4)),VALUE(LEFT(Input!E8,LEN(Input!E8)-10))*0.393701)","v":1.5},{"$f":"IF(RIGHT(Input!F8,4)=\"inch\",VALUE(LEFT(Input!F8,LEN(Input!F8)-4)),VALUE(LEFT(Input!F8,LEN(Input!F8)-10))*0.393701)","v":7.25},{"$f":"IF(RIGHT(Input!H8,4)=\"Feet\",VALUE(LEFT(Input!H8,LEN(Input!H8)-4)),VALUE(LEFT(Input!H8,LEN(Input!H8)-5))*3.28084166666666)","v":12},{"$f":"IF(RIGHT(Input!I8,2)=\"LB\",VALUE(LEFT(Input!I8,LEN(Input!I8)-2)),VALUE(LEFT(Input!I8,LEN(Input!I8)-2))*2.20462)","v":28.287676000000001},{"$f":"VALUE(LEFT(Input!J8,LEN(Input!J8)-3))","v":6.05},1.596770664229882,{"$f":"IF(Input!M8>0,Input!M8,IF(Input!N8>0,Input!N8*2.20462,K8))","v":28.287676000000001},1.596770664229882,{"$f":"Input!O8","v":0},{"$f":"Menu!V$11","v":15},{"$f":"IF(Input!O8>0,O8*(1.857-(0.0237*Menu!V$11))/(1.857-(0.0237*Input!O8)),O8)","v":1.596770664229882},null,"T - 1","Vibration","15-06-2018","SYP","2x8","No. 2","Imperial",3.8100020573999998,18.415009944099999,3.6576000000000004,12.831063532192001,6.05,11009.350504905622,12.831063532192001,11009.350504905622,0,15,11009.350504905622]
[{"$f":"Input!A9","v":"T - 2"},{"$f":"Input!B9","v":"Vibration"},{"$f":"Input!C9","v":"15-06-2018"},{"$f":"IF(Input!D9=\"Southern Yellow Pine\",\"SYP\",IF(Input!D9=\"Douglas-fir\",\"DF\",IF(Input!D9=\"SPF (spruce pine fir)\",\"SPF\",\"Other\")))","v":"SYP"},{"$f":"IF(RIGHT(Input!E9,4)=\"inch\",\"Imperial\",\"SI\")","v":"Imperial"},{"$f":"IF(E9=\"Imperial\",IF(Input!G9=\"1.5x3.5\",\"2x4\",IF(Input!G9=\"1.5x5.5\",\"2x6\",IF(Input!G9=\"1.5x7.25\",\"2x8\",IF(Input!G9=\"1.5x9.25\",\"2x10\",IF(Input!G9=\"1.5x11.25\",\"2x12\",Input!G9))))),Input!G9)","v":"2x8"},{"$f":"Input!L9","v":"No. 1"},{"$f":"IF(RIGHT(Input!E9,4)=\"inch\",VALUE(LEFT(Input!E9,LEN(Input!E9)-4)),VALUE(LEFT(Input!E9,LEN(Input!E9)-10))*0.393701)","v":1.5},{"$f":"IF(RIGHT(Input!F9,4)=\"inch\",VALUE(LEFT(Input!F9,LEN(Input!F9)-4)),VALUE(LEFT(Input!F9,LEN(Input!F9)-10))*0.393701)","v":7.25},{"$f":"IF(RIGHT(Input!H9,4)=\"Feet\",VALUE(LEFT(Input!H9,LEN(Input!H9)-4)),VALUE(LEFT(Input!H9,LEN(Input!H9)-5))*3.28084166666666)","v":12},{"$f":"IF(RIGHT(Input!I9,2)=\"LB\",VALUE(LEFT(Input!I9,LEN(Input!I9)-2)),VALUE(LEFT(Input!I9,LEN(Input!I9)-2))*2.20462)","v":28.287676000000001},{"$f":"VALUE(LEFT(Input!J9,LEN(Input!J9)-3))","v":6.64},1.9233926610922689,{"$f":"IF(Input!M9>0,Input!M9,IF(Input!N9>0,Input!N9*2.20462,K9))","v":28.287676000000001},1.9233926610922689,{"$f":"Input!O9","v":0},{"$f":"Menu!V$11","v":15},{"$f":"IF(Input!O9>0,O9*(1.857-(0.0237*Menu!V$11))/(1.857-(0.0237*Input!O9)),O9)","v":1.9233926610922689},null,"T - 2","Vibration","15-06-2018","SYP","2x8","No. 1","Imperial",3.8100020573999998,18.415009944099999,3.6576000000000004,12.831063532192001,6.64,13261.330783992533,12.831063532192001,13261.330783992533,0,15,13261.330783992533]
[{"$f":"Input!A10","v":"T - 3"},{"$f":"Input!B10","v":"Vibration"},{"$f":"Input!C10","v":"15-06-2018"},{"$f":"IF(Input!D10=\"Southern Yellow Pine\",\"SYP\",IF(Input!D10=\"Douglas-fir\",\"DF\",IF(Input!D10=\"SPF (spruce pine fir)\",\"SPF\",\"Other\")))","v":"SYP"},{"$f":"IF(RIGHT(Input!E10,4)=\"inch\",\"Imperial\",\"SI\")","v":"Imperial"},{"$f":"IF(E10=\"Imperial\",IF(Input!G10=\"1.5x3.5\",\"2x4\",IF(Input!G10=\"1.5x5.5\",\"2x6\",IF(Input!G10=\"1.5x7.25\",\"2x8\",IF(Input!G10=\"1.5x9.25\",\"2x10\",IF(Input!G10=\"1.5x11.25\",\"2x12\",Input!G10))))),Input!G10)","v":"2x8"},{"$f":"Input!L10","v":"No. 1"},{"$f":"IF(RIGHT(Input!E10,4)=\"inch\",VALUE(LEFT(Input!E10,LEN(Input!E10)-4)),VALUE(LEFT(Input!E10,LEN(Input!E10)-10))*0.393701)","v":1.5},{"$f":"IF(RIGHT(Input!F10,4)=\"inch\",VALUE(LEFT(Input!F10,LEN(Input!F10)-4)),VALUE(LEFT(Input!F10,LEN(Input!F10)-10))*0.393701)","v":7.25},{"$f":"IF(RIGHT(Input!H10,4)=\"Feet\",VALUE(LEFT(Input!H10,LEN(Input!H10)-4)),VALUE(LEFT(Input!H10,LEN(Input!H10)-5))*3.28084166666666)","v":12},{"$f":"IF(RIGHT(Input!I10,2)=\"LB\",VALUE(LEFT(Input!I10,LEN(Input!I10)-2)),VALUE(LEFT(Input!I10,LEN(Input!I10)-2))*2.20462)","v":28.287676000000001},{"$f":"VALUE(LEFT(Input!J10,LEN(Input!J10)-3))","v":6.45},1.8148938339901275,{"$f":"IF(Input!M10>0,Input!M10,IF(Input!N10>0,Input!N10*2.20462,K10))","v":28.287676000000001},1.8148938339901275,{"$f":"Input!O10","v":0},{"$f":"Menu!V$11","v":15},{"$f":"IF(Input!O10>0,O10*(1.857-(0.0237*Menu!V$11))/(1.857-(0.0237*Input!O10)),O10)","v":1.8148938339901275},null,"T - 3","Vibration","15-06-2018","SYP","2x8","No. 1","Imperial",3.8100020573999998,18.415009944099999,3.6576000000000004,12.831063532192001,6.45,12513.257410841772,12.831063532192001,12513.257410841772,0,15,12513.257410841772]
[{"$f":"Input!A11","v":"T - 4"},{"$f":"Input!B11","v":"Vibration"},{"$f":"Input!C11","v":"15-06-2018"},{"$f":"IF(Input!D11=\"Southern Yellow Pine\",\"SYP\",IF(Input!D11=\"Douglas-fir\",\"DF\",IF(Input!D11=\"SPF (spruce pine fir)\",\"SPF\",\"Other\")))","v":"SYP"},{"$f":"IF(RIGHT(Input!E11,4)=\"inch\",\"Imperial\",\"SI\")","v":"Imperial"},{"$f":"IF(E11=\"Imperial\",IF(Input!G11=\"1.5x3.5\",\"2x4\",IF(Input!G11=\"1.5x5.5\",\"2x6\",IF(Input!G11=\"1.5x7.25\",\"2x8\",IF(Input!G11=\"1.5x9.25\",\"2x10\",IF(Input!G11=\"1.5x11.25\",\"2x12\",Input!G11))))),Input!G11)","v":"2x8"},{"$f":"Input!L11","v":"No. 2"},{"$f":"IF(RIGHT(Input!E11,4)=\"inch\",VALUE(LEFT(Input!E11,LEN(Input!E11)-4)),VALUE(LEFT(Input!E11,LEN(Input!E11)-10))*0.393701)","v":1.5},{"$f":"IF(RIGHT(Input!F11,4)=\"inch\",VALUE(LEFT(Input!F11,LEN(Input!F11)-4)),VALUE(LEFT(Input!F11,LEN(Input!F11)-10))*0.393701)","v":7.25},{"$f":"IF(RIGHT(Input!H11,4)=\"Feet\",VALUE(LEFT(Input!H11,LEN(Input!H11)-4)),VALUE(LEFT(Input!H11,LEN(Input!H11)-5))*3.28084166666666)","v":12},{"$f":"IF(RIGHT(Input!I11,2)=\"LB\",VALUE(LEFT(Input!I11,LEN(Input!I11)-2)),VALUE(LEFT(Input!I11,LEN(Input!I11)-2))*2.20462)","v":28.287676000000001},{"$f":"VALUE(LEFT(Input!J11,LEN(Input!J11)-3))","v":6.05},1.596770664229882,{"$f":"IF(Input!M11>0,Input!M11,IF(Input!N11>0,Input!N11*2.20462,K11))","v":28.287676000000001},1.596770664229882,{"$f":"Input!O11","v":0},{"$f":"Menu!V$11","v":15},{"$f":"IF(Input!O11>0,O11*(1.857-(0.0237*Menu!V$11))/(1.857-(0.0237*Input!O11)),O11)","v":1.596770664229882},null,"T - 4","Vibration","15-06-2018","SYP","2x8","No. 2","Imperial",3.8100020573999998,18.415009944099999,3.6576000000000004,12.831063532192001,6.05,11009.350504905622,12.831063532192001,11009.350504905622,0,15,11009.350504905622]
[{"$f":"Input!A12","v":"T - 5"},{"$f":"Input!B12","v":"Vibration"},{"$f":"Input!C12","v":"15-06-2018"},{"$f":"IF(Input!D12=\"Southern Yellow Pine\",\"SYP\",IF(Input!D12=\"Douglas-fir\",\"DF\",IF(Input!D12=\"SPF (spruce pine fir)\",\"SPF\",\"Other\")))","v":"SYP"},{"$f":"IF(RIGHT(Input!E12,4)=\"inch\",\"Imperial\",\"SI\")","v":"Imperial"},{"$f":"IF(E12=\"Imperial\",IF(Input!G12=\"1.5x3.5\",\"2x4\",IF(Input!G12=\"1.5x5.5\",\"2x6\",IF(Input!G12=\"1.5x7.25\",\"2x8\",IF(Input!G12=\"1.5x9.25\",\"2x10\",IF(Input!G12=\"1.5x11.25\",\"2x12\",Input!G12))))),Input!G12)","v":"2x8"},{"$f":"Input!L12","v":"No. 1"},{"$f":"IF(RIGHT(Input!E12,4)=\"inch\",VALUE(LEFT(Input!E12,LEN(Input!E12)-4)),VALUE(LEFT(Input!E12,LEN(Input!E12)-10))*0.393701)","v":1.5},{"$f":"IF(RIGHT(Input!F12,4)=\"inch\",VALUE(LEFT(Input!F12,LEN(Input!F12)-4)),VALUE(LEFT(Input!F12,LEN(Input!F12)-10))*0.393701)","v":7.25},{"$f":"IF(RIGHT(Input!H12,4)=\"Feet\",VALUE(LEFT(Input!H12,LEN(Input!H12)-4)),VALUE(LEFT(Input!H12,LEN(Input!H12)-5))*3.28084166666666)","v":12},{"$f":"IF(RIGHT(Input!I12,2)=\"LB\",VALUE(LEFT(Input!I12,LEN(Input!I12)-2)),VALUE(LEFT(Input!I12,LEN(Input!I12)-2))*2.20462)","v":28.287676000000001},{"$f":"VALUE(LEFT(Input!J12,LEN(Input!J12)-3))","v":6.64},1.9233926610922689,{"$f":"IF(Input!M12>0,Input!M12,IF(Input!N12>0,Input!N12*2.20462,K12))","v":28.287676000000001},1.9233926610922689,{"$f":"Input!O12","v":0},{"$f":"Menu!V$11","v":15},{"$f":"IF(Input!O12>0,O12*(1.857-(0.0237*Menu!V$11))/(1.857-(0.0237*Input!O12)),O12)","v":1.9233926610922689},null,"T - 5","Vibration","15-06-2018","SYP","2x8","No. 1","Imperial",3.8100020573999998,18.415009944099999,3.6576000000000004,12.831063532192001,6.64,13261.330783992533,12.831063532192001,13261.330783992533,0,15,13261.330783992533]
[{"$f":"Input!A13","v":"T - 6"},{"$f":"Input!B13","v":"Vibration"},{"$f":"Input!C13","v":"15-06-2018"},{"$f":"IF(Input!D13=\"Southern Yellow Pine\",\"SYP\",IF(Input!D13=\"Douglas-fir\",\"DF\",IF(Input!D13=\"SPF (spruce pine fir)\",\"SPF\",\"Other\")))","v":"SYP"},{"$f":"IF(RIGHT(Input!E13,4)=\"inch\",\"Imperial\",\"SI\")","v":"SI"},{"$f":"IF(E13=\"Imperial\",IF(Input!G13=\"1.5x3.5\",\"2x4\",IF(Input!G13=\"1.5x5.5\",\"2x6\",IF(Input!G13=\"1.5x7.25\",\"2x8\",IF(Input!G13=\"1.5x9.25\",\"2x10\",IF(Input!G13=\"1.5x11.25\",\"2x12\",Input!G13))))),Input!G13)","v":"3.81x18.415"},{"$f":"Input!L13","v":"No. 1"},{"$f":"IF(RIGHT(Input!E13,4)=\"inch\",VALUE(LEFT(Input!E13,LEN(Input!E13)-4)),VALUE(LEFT(Input!E13,LEN(Input!E13)-10))*0.393701)","v":1.5000008100000002},{"$f":"IF(RIGHT(Input!F13,4)=\"inch\",VALUE(LEFT(Input!F13,LEN(Input!F13)-4)),VALUE(LEFT(Input!F13,LEN(Input!F13)-10))*0.393701)","v":7.2500039149999997},{"$f":"IF(RIGHT(Input!H13,4)=\"Feet\",VALUE(LEFT(Input!H13,LEN(Input!H13)-4)),VALUE(LEFT(Input!H13,LEN(Input!H13)-5))*3.28084166666666)","v":12.001318816666643},{"$f":"IF(RIGHT(Input!I13,2)=\"LB\",VALUE(LEFT(Input!I13,LEN(Input!I13)-2)),VALUE(LEFT(Input!I13,LEN(Input!I13)-2))*2.20462)","v":28.2907295684277},{"$f":"VALUE(LEFT(Input!J13,LEN(Input!J13)-3))","v":6.45},1.8156843327922256,{"$f":"IF(Input!M13>0,Input!M13,IF(Input!N13>0,Input!N13*2.20462,K13))","v":28.2907295684277},1.8156843327922256,{"$f":"Input!O13","v":0},{"$f":"Menu!V$11","v":15},{"$f":"IF(Input!O13>0,O13*(1.857-(0.0237*Menu!V$11))/(1.857-(0.0237*Input!O13)),O13)","v":1.8156843327922256},null,"T - 6","Vibration","15-06-2018","SYP","3.81x18.415","No. 1","SI",3.810004114801111,18.415019888205368,3.6580019753199928,12.832448606402258,6.45,12518.707710362525,12.832448606402258,12518.707710362525,0,15,12518.707710362525]
[{"$f":"Input!A14","v":"T - 7"},{"$f":"Input!B14","v":"Vibration"},{"$f":"Input!C14","v":"15-06-2018"},{"$f":"IF(Input!D14=\"Southern Yellow Pine\",\"SYP\",IF(Input!D14=\"Douglas-fir\",\"DF\",IF(Input!D14=\"SPF (spruce pine fir)\",\"SPF\",\"Other\")))","v":"SYP"},{"$f":"IF(RIGHT(Input!E14,4)=\"inch\",\"Imperial\",\"SI\")","v":"SI"},{"$f":"IF(E14=\"Imperial\",IF(Input!G14=\"1.5x3.5\",\"2x4\",IF(Input!G14=\"1.5x5.5\",\"2x6\",IF(Input!G14=\"1.5x7.25\",\"2x8\",IF(Input!G14=\"1.5x9.25\",\"2x10\",IF(Input!G14=\"1.5x11.25\",\"2x12\",Input!G14))))),Input!G14)","v":"3.81x18.415"},{"$f":"Input!L14","v":"No. 2"},{"$f":"IF(RIGHT(Input!E14,4)=\"inch\",VALUE(LEFT(Input!E14,LEN(Input!E14)-4)),VALUE(LEFT(Input!E14,LEN(Input!E14)-10))*0.393701)","v":1.5000008100000002},{"$f":"IF(RIGHT(Input!F14,4)=\"inch\",VALUE(LEFT(Input!F14,LEN(Input!F14)-4)),VALUE(LEFT(Input!F14,LEN(Input!F14)-10))*0.393701)","v":7.2500039149999997},{"$f":"IF(RIGHT(Input!H14,4)=\"Feet\",VALUE(LEFT(Input!H14,LEN(Input!H14)-4)),VALUE(LEFT(Input!H14,LEN(Input!H14)-5))*3.28084166666666)","v":12.001318816666643},{"$f":"IF(RIGHT(Input!I14,2)=\"LB\",VALUE(LEFT(Input!I14,LEN(Input!I14)-2)),VALUE(LEFT(Input!I14,LEN(Input!I14)-2))*2.20462)","v":28.2907295684277},{"$f":"VALUE(LEFT(Input!J14,LEN(Input!J14)-3))","v":6.05},1.5974661568662318,{"$f":"IF(Input!M14>0,Input!M14,IF(Input!N14>0,Input!N14*2.20462,K14))","v":28.2907295684277},1.5974661568662318,{"$f":"Input!O14","v":0},{"$f":"Menu!V$11","v":15},{"$f":"IF(Input!O14>0,O14*(1.857-(0.0237*Menu!V$11))/(1.857-(0.0237*Input!O14)),O14)","v":1.5974661568662318},null,"T - 7","Vibration","15-06-2018","SYP","3.81x18.415","No. 2","SI",3.810004114801111,18.415019888205368,3.6580019753199928,12.832448606402258,6.05,11014.14575971502,12.832448606402258,11014.14575971502,0,15,11014.14575971502]
[{"$f":"Input!A15","v":"T - 8"},{"$f":"Input!B15","v":"Vibration"},{"$f":"Input!C15","v":"15-06-2018"},{"$f":"IF(Input!D15=\"Southern Yellow Pine\",\"SYP\",IF(Input!D15=\"Douglas-fir\",\"DF\",IF(Input!D15=\"SPF (spruce pine fir)\",\"SPF\",\"Other\")))","v":"SYP"},{"$f":"IF(RIGHT(Input!E15,4)=\"inch\",\"Imperial\",\"SI\")","v":"SI"},{"$f":"IF(E15=\"Imperial\",IF(Input!G15=\"1.5x3.5\",\"2x4\",IF(Input!G15=\"1.5x5.5\",\"2x6\",IF(Input!G15=\"1.5x7.25\",\"2x8\",IF(Input!G15=\"1.5x9.25\",\"2x10\",IF(Input!G15=\"1.5x11.25\",\"2x12\",Input!G15))))),Input!G15)","v":"3.81x18.415"},{"$f":"Input!L15","v":"No. 1"},{"$f":"IF(RIGHT(Input!E15,4)=\"inch\",VALUE(LEFT(Input!E15,LEN(Input!E15)-4)),VALUE(LEFT(Input!E15,LEN(Input!E15)-10))*0.393701)","v":1.5000008100000002},{"$f":"IF(RIGHT(Input!F15,4)=\"inch\",VALUE(LEFT(Input!F15,LEN(Input!F15)-4)),VALUE(LEFT(Input!F15,LEN(Input!F15)-10))*0.393701)","v":7.2500039149999997},{"$f":"IF(RIGHT(Input!H15,4)=\"Feet\",VALUE(LEFT(Input!H15,LEN(Input!H15)-4)),VALUE(LEFT(Input!H15,LEN(Input!H15)-5))*3.28084166666666)","v":12.001318816666643},{"$f":"IF(RIGHT(Input!I15,2)=\"LB\",VALUE(LEFT(Input!I15,LEN(Input!I15)-2)),VALUE(LEFT(Input!I15,LEN(Input!I15)-2))*2.20462)","v":28.2907295684277},{"$f":"VALUE(LEFT(Input!J15,LEN(Input!J15)-3))","v":6.64},1.9242304178613328,{"$f":"IF(Input!M15>0,Input!M15,IF(Input!N15>0,Input!N15*2.20462,K15))","v":28.2907295684277},1.9242304178613328,{"$f":"Input!O15","v":0},{"$f":"Menu!V$11","v":15},{"$f":"IF(Input!O15>0,O15*(1.857-(0.0237*Menu!V$11))/(1.857-(0.0237*Input!O15)),O15)","v":1.9242304178613328},null,"T - 8","Vibration","15-06-2018","SYP","3.81x18.415","No. 1","SI",3.810004114801111,18.415019888205368,3.6580019753199928,12.832448606402258,6.64,13267.106915853603,12.832448606402258,13267.106915853603,0,15,13267.106915853603]
[{"$f":"Input!A16","v":"T - 9"},{"$f":"Input!B16","v":"Vibration"},{"$f":"Input!C16","v":"15-06-2018"},{"$f":"IF(Input!D16=\"Southern Yellow Pine\",\"SYP\",IF(Input!D16=\"Douglas-fir\",\"DF\",IF(Input!D16=\"SPF (spruce pine fir)\",\"SPF\",\"Other\")))","v":"SYP"},{"$f":"IF(RIGHT(Input!E16,4)=\"inch\",\"Imperial\",\"SI\")","v":"SI"},{"$f":"IF(E16=\"Imperial\",IF(Input!G16=\"1.5x3.5\",\"2x4\",IF(Input!G16=\"1.5x5.5\",\"2x6\",IF(Input!G16=\"1.5x7.25\",\"2x8\",IF(Input!G16=\"1.5x9.25\",\"2x10\",IF(Input!G16=\"1.5x11.25\",\"2x12\",Input!G16))))),Input!G16)","v":"3.81x18.415"},{"$f":"Input!L16","v":"No. 1"},{"$f":"IF(RIGHT(Input!E16,4)=\"inch\",VALUE(LEFT(Input!E16,LEN(Input!E16)-4)),VALUE(LEFT(Input!E16,LEN(Input!E16)-10))*0.393701)","v":1.5000008100000002},{"$f":"IF(RIGHT(Input!F16,4)=\"inch\",VALUE(LEFT(Input!F16,LEN(Input!F16)-4)),VALUE(LEFT(Input!F16,LEN(Input!F16)-10))*0.393701)","v":7.2500039149999997},{"$f":"IF(RIGHT(Input!H16,4)=\"Feet\",VALUE(LEFT(Input!H16,LEN(Input!H16)-4)),VALUE(LEFT(Input!H16,LEN(Input!H16)-5))*3.28084166666666)","v":12.001318816666643},{"$f":"IF(RIGHT(Input!I16,2)=\"LB\",VALUE(LEFT(Input!I16,LEN(Input!I16)-2)),VALUE(LEFT(Input!I16,LEN(Input!I16)-2))*2.20462)","v":28.2907295684277},{"$f":"VALUE(LEFT(Input!J16,LEN(Input!J16)-3))","v":6.45},1.8156843327922256,{"$f":"IF(Input!M16>0,Input!M16,IF(Input!N16>0,Input!N16*2.20462,K16))","v":28.2907295684277},1.8156843327922256,{"$f":"Input!O16","v":0},{"$f":"Menu!V$11","v":15},{"$f":"IF(Input!O16>0,O16*(1.857-(0.0237*Menu!V$11))/(1.857-(0.0237*Input!O16)),O16)","v":1.8156843327922256},null,"T - 9","Vibration","15-06-2018","SYP","3.81x18.415","No. 1","SI",3.810004114801111,18.415019888205368,3.6580019753199928,12.832448606402258,6.45,12518.707710362525,12.832448606402258,12518.707710362525,0,15,12518.707710362525]
[{"$f":"Input!A17","v":"T - 10"},{"$f":"Input!B17","v":"Vibration"},{"$f":"Input!C17","v":"15-06-2018"},{"$f":"IF(Input!D17=\"Southern Yellow Pine\",\"SYP\",IF(Input!D17=\"Douglas-fir\",\"DF\",IF(Input!D17=\"SPF (spruce pine fir)\",\"SPF\",\"Other\")))","v":"SYP"},{"$f":"IF(RIGHT(Input!E17,4)=\"inch\",\"Imperial\",\"SI\")","v":"SI"},{"$f":"IF(E17=\"Imperial\",IF(Input!G17=\"1.5x3.5\",\"2x4\",IF(Input!G17=\"1.5x5.5\",\"2x6\",IF(Input!G17=\"1.5x7.25\",\"2x8\",IF(Input!G17=\"1.5x9.25\",\"2x10\",IF(Input!G17=\"1.5x11.25\",\"2x12\",Input!G17))))),Input!G17)","v":"3.81x18.415"},{"$f":"Input!L17","v":"No. 2"},{"$f":"IF(RIGHT(Input!E17,4)=\"inch\",VALUE(LEFT(Input!E17,LEN(Input!E17)-4)),VALUE(LEFT(Input!E17,LEN(Input!E17)-10))*0.393701)","v":1.5000008100000002},{"$f":"IF(RIGHT(Input!F17,4)=\"inch\",VALUE(LEFT(Input!F17,LEN(Input!F17)-4)),VALUE(LEFT(Input!F17,LEN(Input!F17)-10))*0.393701)","v":7.2500039149999997},{"$f":"IF(RIGHT(Input!H17,4)=\"Feet\",VALUE(LEFT(Input!H17,LEN(Input!H17)-4)),VALUE(LEFT(Input!H17,LEN(Input!H17)-5))*3.28084166666666)","v":12.001318816666643},{"$f":"IF(RIGHT(Input!I17,2)=\"LB\",VALUE(LEFT(Input!I17,LEN(Input!I17)-2)),VALUE(LEFT(Input!I17,LEN(Input!I17)-2))*2.20462)","v":28.2907295684277},{"$f":"VALUE(LEFT(Input!J17,LEN(Input!J17)-3))","v":6.05},1.5974661568662318,{"$f":"IF(Input!M17>0,Input!M17,IF(Input!N17>0,Input!N17*2.20462,K17))","v":28.2907295684277},1.5974661568662318,{"$f":"Input!O17","v":0},{"$f":"Menu!V$11","v":15},{"$f":"IF(Input!O17>0,O17*(1.857-(0.0237*Menu!V$11))/(1.857-(0.0237*Input!O17)),O17)","v":1.5974661568662318},null,"T - 10","Vibration","15-06-2018","SYP","3.81x18.415","No. 2","SI",3.810004114801111,18.415019888205368,3.6580019753199928,12.832448606402258,6.05,11014.14575971502,12.832448606402258,11014.14575971502,0,15,11014.14575971502]
[{"$f":"Input!A18","v":"T - 11"},{"$f":"Input!B18","v":"Vibration"},{"$f":"Input!C18","v":"15-06-2018"},{"$f":"IF(Input!D18=\"Southern Yellow Pine\",\"SYP\",IF(Input!D18=\"Douglas-fir\",\"DF\",IF(Input!D18=\"SPF (spruce pine fir)\",\"SPF\",\"Other\")))","v":"SYP"},{"$f":"IF(RIGHT(Input!E18,4)=\"inch\",\"Imperial\",\"SI\")","v":"SI"},{"$f":"IF(E18=\"Imperial\",IF(Input!G18=\"1.5x3.5\",\"2x4\",IF(Input!G18=\"1.5x5.5\",\"2x6\",IF(Input!G18=\"1.5x7.25\",\"2x8\",IF(Input!G18=\"1.5x9.25\",\"2x10\",IF(Input!G18=\"1.5x11.25\",\"2x12\",Input!G18))))),Input!G18)","v":"3.81x18.415"},{"$f":"Input!L18","v":"No. 1"},{"$f":"IF(RIGHT(Input!E18,4)=\"inch\",VALUE(LEFT(Input!E18,LEN(Input!E18)-4)),VALUE(LEFT(Input!E18,LEN(Input!E18)-10))*0.393701)","v":1.5000008100000002},{"$f":"IF(RIGHT(Input!F18,4)=\"inch\",VALUE(LEFT(Input!F18,LEN(Input!F18)-4)),VALUE(LEFT(Input!F18,LEN(Input!F18)-10))*0.393701)","v":7.2500039149999997},{"$f":"IF(RIGHT(Input!H18,4)=\"Feet\",VALUE(LEFT(Input!H18,LEN(Input!H18)-4)),VALUE(LEFT(Input!H18,LEN(Input!H18)-5))*3.28084166666666)","v":12.001318816666643},{"$f":"IF(RIGHT(Input!I18,2)=\"LB\",VALUE(LEFT(Input!I18,LEN(Input!I18)-2)),VALUE(LEFT(Input!I18,LEN(Input!I18)-2))*2.20462)","v":28.2907295684277},{"$f":"VALUE(LEFT(Input!J18,LEN(Input!J18)-3))","v":6.64},1.9242304178613328,{"$f":"IF(Input!M18>0,Input!M18,IF(Input!N18>0,Input!N18*2.20462,K18))","v":28.2907295684277},1.9242304178613328,{"$f":"Input!O18","v":0},{"$f":"Menu!V$11","v":15},{"$f":"IF(Input!O18>0,O18*(1.857-(0.0237*Menu!V$11))/(1.857-(0.0237*Input!O18)),O18)","v":1.9242304178613328},null,"T - 11","Vibration","15-06-2018","SYP","3.81x18.415","No. 1","SI",3.810004114801111,18.415019888205368,3.6580019753199928,12.832448606402258,6.64,13267.106915853603,12.832448606402258,13267.106915853603,0,15,13267.106915853603]
[{"$f":"Input!A19","v":"T - 12"},{"$f":"Input!B19","v":"Soundwave"},{"$f":"Input!C19","v":"15-06-2018"},{"$f":"IF(Input!D19=\"Southern Yellow Pine\",\"SYP\",IF(Input!D19=\"Douglas-fir\",\"DF\",IF(Input!D19=\"SPF (spruce pine fir)\",\"SPF\",\"Other\")))","v":"SYP"},{"$f":"IF(RIGHT(Input!E19,4)=\"inch\",\"Imperial\",\"SI\")","v":"Imperial"},{"$f":"IF(E19=\"Imperial\",IF(Input!G19=\"1.5x3.5\",\"2x4\",IF(Input!G19=\"1.5x5.5\",\"2x6\",IF(Input!G19=\"1.5x7.25\",\"2x8\",IF(Input!G19=\"1.5x9.25\",\"2x10\",IF(Input!G19=\"1.5x11.25\",\"2x12\",Input!G19))))),Input!G19)","v":"2x8"},{"$f":"Input!L19","v":"No. 2"},{"$f":"IF(RIGHT(Input!E19,4)=\"inch\",VALUE(LEFT(Input!E19,LEN(Input!E19)-4)),VALUE(LEFT(Input!E19,LEN(Input!E19)-10))*0.393701)","v":1.5},{"$f":"IF(RIGHT(Input!F19,4)=\"inch\",VALUE(LEFT(Input!F19,LEN(Input!F19)-4)),VALUE(LEFT(Input!F19,LEN(Input!F19)-10))*0.393701)","v":7.25},{"$f":"IF(RIGHT(Input!H19,4)=\"Feet\",VALUE(LEFT(Input!H19,LEN(Input!H19)-4)),VALUE(LEFT(Input!H19,LEN(Input!H19)-5))*3.28084166666666)","v":12.000999999999999},{"$f":"IF(RIGHT(Input!I19,2)=\"LB\",VALUE(LEFT(Input!I19,LEN(Input!I19)-2)),VALUE(LEFT(Input!I19,LEN(Input!I19)-2))*2.20462)","v":28.290033000000001},{"$f":"VALUE(LEFT(Input!J19,LEN(Input!J19)-3))","v":678.46},1.7869979444237298,{"$f":"IF(Input!M19>0,Input!M19,IF(Input!N19>0,Input!N19*2.20462,K19))","v":28.290033000000001},1.7869979444237298,{"$f":"Input!O19","v":0},{"$f":"Menu!V$11","v":15},{"$f":"IF(Input!O19>0,O19*(1.857-(0.0237*Menu!V$11))/(1.857-(0.0237*Input!O19)),O19)","v":1.7869979444237298},null,"T - 12","Soundwave","15-06-2018","SYP","2x8","No. 2","Imperial",3.8100020573999998,18.415009944099999,3.6579047999999998,12.832132648536,678.46,12320.921947294955,12.832132648536,12320.921947294955,0,15,12320.921947294955]
[{"$f":"Input!A20","v":"T - 13"},{"$f":"Input!B20","v":"Soundwave"},{"$f":"Input!C20","v":"15-06-2018"},{"$f":"IF(Input!D20=\"Southern Yellow Pine\",\"SYP\",IF(Input!D20=\"Douglas-fir\",\"DF\",IF(Input!D20=\"SPF (spruce pine fir)\",\"SPF\",\"Other\")))","v":"SYP"},{"$f":"IF(RIGHT(Input!E20,4)=\"inch\",\"Imperial\",\"SI\")","v":"Imperial"},{"$f":"IF(E20=\"Imperial\",IF(Input!G20=\"1.5x3.5\",\"2x4\",IF(Input!G20=\"1.5x5.5\",\"2x6\",IF(Input!G20=\"1.5x7.25\",\"2x8\",IF(Input!G20=\"1.5x9.25\",\"2x10\",IF(Input!G20=\"1.5x11.25\",\"2x12\",Input!G20))))),Input!G20)","v":"2x8"},{"$f":"Input!L20","v":"No. 2"},{"$f":"IF(RIGHT(Input!E20,4)=\"inch\",VALUE(LEFT(Input!E20,LEN(Input!E20)-4)),VALUE(LEFT(Input!E20,LEN(Input!E20)-10))*0.393701)","v":1.5},{"$f":"IF(RIGHT(Input!F20,4)=\"inch\",VALUE(LEFT(Input!F20,LEN(Input!F20)-4)),VALUE(LEFT(Input!F20,LEN(Input!F20)-10))*0.393701)","v":7.25},{"$f":"IF(RIGHT(Input!H20,4)=\"Feet\",VALUE(LEFT(Input!H20,LEN(Input!H20)-4)),VALUE(LEFT(Input!H20,LEN(Input!H20)-5))*3.28084166666666)","v":12.000999999999999},{"$f":"IF(RIGHT(Input!I20,2)=\"LB\",VALUE(LEFT(Input!I20,LEN(Input!I20)-2)),VALUE(LEFT(Input!I20,LEN(Input!I20)-2))*2.20462)","v":28.290033000000001},{"$f":"VALUE(LEFT(Input!J20,LEN(Input!J20)-3))","v":658.21},1.6819168020856541,{"$f":"IF(Input!M20>0,Input!M20,IF(Input!N20>0,Input!N20*2.20462,K20))","v":28.290033000000001},1.6819168020856541,{"$f":"Input!O20","v":0},{"$f":"Menu!V$11","v":15},{"$f":"IF(Input!O20>0,O20*(1.857-(0.0237*Menu!V$11))/(1.857-(0.0237*Input!O20)),O20)","v":1.6819168020856541},null,"T - 13","Soundwave","15-06-2018","SYP","2x8","No. 2","Imperial",3.8100020573999998,18.415009944099999,3.6579047999999998,12.832132648536,658.21,11596.412690348085,12.832132648536,11596.412690348085,0,15,11596.412690348085]
[{"$f":"Input!A21","v":"T - 14"},{"$f":"Input!B21","v":"Soundwave"},{"$f":"Input!C21","v":"15-06-2018"},{"$f":"IF(Input!D21=\"Southern Yellow Pine\",\"SYP\",IF(Input!D21=\"Douglas-fir\",\"DF\",IF(Input!D21=\"SPF (spruce pine fir)\",\"SPF\",\"Other\")))","v":"SYP"},{"$f":"IF(RIGHT(Input!E21,4)=\"inch\",\"Imperial\",\"SI\")","v":"Imperial"},{"$f":"IF(E21=\"Imperial\",IF(Input!G21=\"1.5x3.5\",\"2x4\",IF(Input!G21=\"1.5x5.5\",\"2x6\",IF(Input!G21=\"1.5x7.25\",\"2x8\",IF(Input!G21=\"1.5x9.25\",\"2x10\",IF(Input!G21=\"1.5x11.25\",\"2x12\",Input!G21))))),Input!G21)","v":"2x8"},{"$f":"Input!L21","v":"No. 2"},{"$f":"IF(RIGHT(Input!E21,4)=\"inch\",VALUE(LEFT(Input!E21,LEN(Input!E21)-4)),VALUE(LEFT(Input!E21,LEN(Input!E21)-10))*0.393701)","v":1.5},{"$f":"IF(RIGHT(Input!F21,4)=\"inch\",VALUE(LEFT(Input!F21,LEN(Input!F21)-4)),VALUE(LEFT(Input!F21,LEN(Input!F21)-10))*0.393701)","v":7.25},{"$f":"IF(RIGHT(Input!H21,4)=\"Feet\",VALUE(LEFT(Input!H21,LEN(Input!H21)-4)),VALUE(LEFT(Input!H21,LEN(Input!H21)-5))*3.28084166666666)","v":12.000999999999999},{"$f":"IF(RIGHT(Input!I21,2)=\"LB\",VALUE(LEFT(Input!I21,LEN(Input!I21)-2)),VALUE(LEFT(Input!I21,LEN(Input!I21)-2))*2.20462)","v":28.290033000000001},{"$f":"VALUE(LEFT(Input!J21,LEN(Input!J21)-3))","v":639.13},1.5858202654333382,{"$f":"IF(Input!M21>0,Input!M21,IF(Input!N21>0,Input!N21*2.20462,K21))","v":28.290033000000001},1.5858202654333382,{"$f":"Input!O21","v":0},{"$f":"Menu!V$11","v":15},{"$f":"IF(Input!O21>0,O21*(1.857-(0.0237*Menu!V$11))/(1.857-(0.0237*Input!O21)),O21)","v":1.5858202654333382},null,"T - 14","Soundwave","15-06-2018","SYP","2x8","No. 2","Imperial",3.8100020573999998,18.415009944099999,3.6579047999999998,12.832132648536,639.13,10933.850133299164,12.832132648536,10933.850133299164,0,15,10933.850133299164]
[{"$f":"Input!A22","v":"T - 15"},{"$f":"Input!B22","v":"Soundwave"},{"$f":"Input!C22","v":"15-06-2018"},{"$f":"IF(Input!D22=\"Southern Yellow Pine\",\"SYP\",IF(Input!D22=\"Douglas-fir\",\"DF\",IF(Input!D22=\"SPF (spruce pine fir)\",\"SPF\",\"Other\")))","v":"SYP"},{"$f":"IF(RIGHT(Input!E22,4)=\"inch\",\"Imperial\",\"SI\")","v":"Imperial"},{"$f":"IF(E22=\"Imperial\",IF(Input!G22=\"1.5x3.5\",\"2x4\",IF(Input!G22=\"1.5x5.5\",\"2x6\",IF(Input!G22=\"1.5x7.25\",\"2x8\",IF(Input!G22=\"1.5x9.25\",\"2x10\",IF(Input!G22=\"1.5x11.25\",\"2x12\",Input!G22))))),Input!G22)","v":"2x8"},{"$f":"Input!L22","v":"No. 1"},{"$f":"IF(RIGHT(Input!E22,4)=\"inch\",VALUE(LEFT(Input!E22,LEN(Input!E22)-4)),VALUE(LEFT(Input!E22,LEN(Input!E22)-10))*0.393701)","v":1.5},{"$f":"IF(RIGHT(Input!F22,4)=\"inch\",VALUE(LEFT(Input!F22,LEN(Input!F22)-4)),VALUE(LEFT(Input!F22,LEN(Input!F22)-10))*0.393701)","v":7.25},{"$f":"IF(RIGHT(Input!H22,4)=\"Feet\",VALUE(LEFT(Input!H22,LEN(Input!H22)-4)),VALUE(LEFT(Input!H22,LEN(Input!H22)-5))*3.28084166666666)","v":12.000999999999999},{"$f":"IF(RIGHT(Input!I22,2)=\"LB\",VALUE(LEFT(Input!I22,LEN(Input!I22)-2)),VALUE(LEFT(Input!I22,LEN(Input!I22)-2))*2.20462)","v":28.290033000000001},{"$f":"VALUE(LEFT(Input!J22,LEN(Input!J22)-3))","v":722.95},2.0290468786806142,{"$f":"IF(Input!M22>0,Input!M22,IF(Input!N22>0,Input!N22*2.20462,K22))","v":28.290033000000001},2.0290468786806142,{"$f":"Input!O22","v":0},{"$f":"Menu!V$11","v":15},{"$f":"IF(Input!O22>0,O22*(1.857-(0.0237*Menu!V$11))/(1.857-(0.0237*Input!O22)),O22)","v":2.0290468786806142},null,"T - 15","Soundwave","15-06-2018","SYP","2x8","No. 1","Imperial",3.8100020573999998,18.415009944099999,3.6579047999999998,12.832132648536,722.95,13989.791257251953,12.832132648536,13989.791257251953,0,15,13989.791257251953]
[{"$f":"Input!A23","v":"T - 16"},{"$f":"Input!B23","v":"Soundwave"},{"$f":"Input!C23","v":"15-06-2018"},{"$f":"IF(Input!D23=\"Southern Yellow Pine\",\"SYP\",IF(Input!D23=\"Douglas-fir\",\"DF\",IF(Input!D23=\"SPF (spruce pine fir)\",\"SPF\",\"Other\")))","v":"SYP"},{"$f":"IF(RIGHT(Input!E23,4)=\"inch\",\"Imperial\",\"SI\")","v":"Imperial"},{"$f":"IF(E23=\"Imperial\",IF(Input!G23=\"1.5x3.5\",\"2x4\",IF(Input!G23=\"1.5x5.5\",\"2x6\",IF(Input!G23=\"1.5x7.25\",\"2x8\",IF(Input!G23=\"1.5x9.25\",\"2x10\",IF(Input!G23=\"1.5x11.25\",\"2x12\",Input!G23))))),Input!G23)","v":"2x8"},{"$f":"Input!L23","v":"No. 2"},{"$f":"IF(RIGHT(Input!E23,4)=\"inch\",VALUE(LEFT(Input!E23,LEN(Input!E23)-4)),VALUE(LEFT(Input!E23,LEN(Input!E23)-10))*0.393701)","v":1.5},{"$f":"IF(RIGHT(Input!F23,4)=\"inch\",VALUE(LEFT(Input!F23,LEN(Input!F23)-4)),VALUE(LEFT(Input!F23,LEN(Input!F23)-10))*0.393701)","v":7.25},{"$f":"IF(RIGHT(Input!H23,4)=\"Feet\",VALUE(LEFT(Input!H23,LEN(Input!H23)-4)),VALUE(LEFT(Input!H23,LEN(Input!H23)-5))*3.28084166666666)","v":12.000999999999999},{"$f":"IF(RIGHT(Input!I23,2)=\"LB\",VALUE(LEFT(Input!I23,LEN(Input!I23)-2)),VALUE(LEFT(Input!I23,LEN(Input!I23)-2))*2.20462)","v":28.290033000000001},{"$f":"VALUE(LEFT(Input!J23,LEN(Input!J23)-3))","v":678.46},1.7869979444237298,{"$f":"IF(Input!M23>0,Input!M23,IF(Input!N23>0,Input!N23*2.20462,K23))","v":28.290033000000001},1.7869979444237298,{"$f":"Input!O23","v":0},{"$f":"Menu!V$11","v":15},{"$f":"IF(Input!O23>0,O23*(1.857-(0.0237*Menu!V$11))/(1.857-(0.0237*Input!O23)),O23)","v":1.7869979444237298},null,"T - 16","Soundwave","15-06-2018","SYP","2x8","No. 2","Imperial",3.8100020573999998,18.415009944099999,3.6579047999999998,12.832132648536,678.46,12320.921947294955,12.832132648536,12320.921947294955,0,15,12320.921947294955]
[{"$f":"Input!A24","v":"T - 17"},{"$f":"Input!B24","v":"Soundwave"},{"$f":"Input!C24","v":"15-06-2018"},{"$f":"IF(Input!D24=\"Southern Yellow Pine\",\"SYP\",IF(Input!D24=\"Douglas-fir\",\"DF\",IF(Input!D24=\"SPF (spruce pine fir)\",\"SPF\",\"Other\")))","v":"SYP"},{"$f":"IF(RIGHT(Input!E24,4)=\"inch\",\"Imperial\",\"SI\")","v":"Imperial"},{"$f":"IF(E24=\"Imperial\",IF(Input!G24=\"1.5x3.5\",\"2x4\",IF(Input!G24=\"1.5x5.5\",\"2x6\",IF(Input!G24=\"1.5x7.25\",\"2x8\",IF(Input!G24=\"1.5x9.25\",\"2x10\",IF(Input!G24=\"1.5x11.25\",\"2x12\",Input!G24))))),Input!G24)","v":"2x8"},{"$f":"Input!L24","v":"No. 2"},{"$f":"IF(RIGHT(Input!E24,4)=\"inch\",VALUE(LEFT(Input!E24,LEN(Input!E24)-4)),VALUE(LEFT(Input!E24,LEN(Input!E24)-10))*0.393701)","v":1.5},{"$f":"IF(RIGHT(Input!F24,4)=\"inch\",VALUE(LEFT(Input!F24,LEN(Input!F24)-4)),VALUE(LEFT(Input!F24,LEN(Input!F24)-10))*0.393701)","v":7.25},{"$f":"IF(RIGHT(Input!H24,4)=\"Feet\",VALUE(LEFT(Input!H24,LEN(Input!H24)-4)),VALUE(LEFT(Input!H24,LEN(Input!H24)-5))*3.28084166666666)","v":12.000999999999999},{"$f":"IF(RIGHT(Input!I24,2)=\"LB\",VALUE(LEFT(Input!I24,LEN(Input!I24)-2)),VALUE(LEFT(Input!I24,LEN(Input!I24)-2))*2.20462)","v":28.290033000000001},{"$f":"VALUE(LEFT(Input!J24,LEN(Input!J24)-3))","v":648.53},1.6328101756712874,{"$f":"IF(Input!M24>0,Input!M24,IF(Input!N24>0,Input!N24*2.20462,K24))","v":28.290033000000001},1.6328101756712874,{"$f":"Input!O24","v":0},{"$f":"Menu!V$11","v":15},{"$f":"IF(Input!O24>0,O24*(1.857-(0.0237*Menu!V$11))/(1.857-(0.0237*Input!O24)),O24)","v":1.6328101756712874},null,"T - 17","Soundwave","15-06-2018","SYP","2x8","No. 2","Imperial",3.8100020573999998,18.415009944099999,3.6579047999999998,12.832132648536,648.53,11257.834286811365,12.832132648536,11257.834286811365,0,15,11257.834286811365]
[{"$f":"Input!A25","v":"T - 18"},{"$f":"Input!B25","v":"Soundwave"},{"$f":"Input!C25","v":"15-06-2018"},{"$f":"IF(Input!D25=\"Southern Yellow Pine\",\"SYP\",IF(Input!D25=\"Douglas-fir\",\"DF\",IF(Input!D25=\"SPF (spruce pine fir)\",\"SPF\",\"Other\")))","v":"SYP"},{"$f":"IF(RIGHT(Input!E25,4)=\"inch\",\"Imperial\",\"SI\")","v":"Imperial"},{"$f":"IF(E25=\"Imperial\",IF(Input!G25=\"1.5x3.5\",\"2x4\",IF(Input!G25=\"1.5x5.5\",\"2x6\",IF(Input!G25=\"1.5x7.25\",\"2x8\",IF(Input!G25=\"1.5x9.25\",\"2x10\",IF(Input!G25=\"1.5x11.25\",\"2x12\",Input!G25))))),Input!G25)","v":"2x8"},{"$f":"Input!L25","v":"No. 1"},{"$f":"IF(RIGHT(Input!E25,4)=\"inch\",VALUE(LEFT(Input!E25,LEN(Input!E25)-4)),VALUE(LEFT(Input!E25,LEN(Input!E25)-10))*0.393701)","v":1.5},{"$f":"IF(RIGHT(Input!F25,4)=\"inch\",VALUE(LEFT(Input!F25,LEN(Input!F25)-4)),VALUE(LEFT(Input!F25,LEN(Input!F25)-10))*0.393701)","v":7.25},{"$f":"IF(RIGHT(Input!H25,4)=\"Feet\",VALUE(LEFT(Input!H25,LEN(Input!H25)-4)),VALUE(LEFT(Input!H25,LEN(Input!H25)-5))*3.28084166666666)","v":12.000999999999999},{"$f":"IF(RIGHT(Input!I25,2)=\"LB\",VALUE(LEFT(Input!I25,LEN(Input!I25)-2)),VALUE(LEFT(Input!I25,LEN(Input!I25)-2))*2.20462)","v":28.290033000000001},{"$f":"VALUE(LEFT(Input!J25,LEN(Input!J25)-3))","v":722.95},2.0290468786806142,{"$f":"IF(Input!M25>0,Input!M25,IF(Input!N25>0,Input!N25*2.20462,K25))","v":28.290033000000001},2.0290468786806142,{"$f":"Input!O25","v":0},{"$f":"Menu!V$11","v":15},{"$f":"IF(Input!O25>0,O25*(1.857-(0.0237*Menu!V$11))/(1.857-(0.0237*Input!O25)),O25)","v":2.0290468786806142},null,"T - 18","Soundwave","15-06-2018","SYP","2x8","No. 1","Imperial",3.8100020573999998,18.415009944099999,3.6579047999999998,12.832132648536,722.95,13989.791257251953,12.832132648536,13989.791257251953,0,15,13989.791257251953]
[{"$f":"Input!A26","v":"T - 19"},{"$f":"Input!B26","v":"Soundwave"},{"$f":"Input!C26","v":"15-06-2018"},{"$f":"IF(Input!D26=\"Southern Yellow Pine\",\"SYP\",IF(Input!D26=\"Douglas-fir\",\"DF\",IF(Input!D26=\"SPF (spruce pine fir)\",\"SPF\",\"Other\")))","v":"SYP"},{"$f":"IF(RIGHT(Input!E26,4)=\"inch\",\"Imperial\",\"SI\")","v":"SI"},{"$f":"IF(E26=\"Imperial\",IF(Input!G26=\"1.5x3.5\",\"2x4\",IF(Input!G26=\"1.5x5.5\",\"2x6\",IF(Input!G26=\"1.5x7.25\",\"2x8\",IF(Input!G26=\"1.5x9.25\",\"2x10\",IF(Input!G26=\"1.5x11.25\",\"2x12\",Input!G26))))),Input!G26)","v":"3.81x18.415"},{"$f":"Input!L26","v":"No. 2"},{"$f":"IF(RIGHT(Input!E26,4)=\"inch\",VALUE(LEFT(Input!E26,LEN(Input!E26)-4)),VALUE(LEFT(Input!E26,LEN(Input!E26)-10))*0.393701)","v":1.5000008100000002},{"$f":"IF(RIGHT(Input!F26,4)=\"inch\",VALUE(LEFT(Input!F26,LEN(Input!F26)-4)),VALUE(LEFT(Input!F26,LEN(Input!F26)-10))*0.393701)","v":7.2500039149999997},{"$f":"IF(RIGHT(Input!H26,4)=\"Feet\",VALUE(LEFT(Input!H26,LEN(Input!H26)-4)),VALUE(LEFT(Input!H26,LEN(Input!H26)-5))*3.28084166666666)","v":12.001318816666643},{"$f":"IF(RIGHT(Input!I26,2)=\"LB\",VALUE(LEFT(Input!I26,LEN(Input!I26)-2)),VALUE(LEFT(Input!I26,LEN(Input!I26)-2))*2.20462)","v":28.2907295684277},{"$f":"VALUE(LEFT(Input!J26,LEN(Input!J26)-3))","v":668.18},1.7333420091264191,{"$f":"IF(Input!M26>0,Input!M26,IF(Input!N26>0,Input!N26*2.20462,K26))","v":28.2907295684277},1.7333420091264191,{"$f":"Input!O26","v":0},{"$f":"Menu!V$11","v":15},{"$f":"IF(Input!O26>0,O26*(1.857-(0.0237*Menu!V$11))/(1.857-(0.0237*Input!O26)),O26)","v":1.7333420091264191},null,"T - 19","Soundwave","15-06-2018","SYP","3.81x18.415","No. 2","SI",3.810004114801111,18.415019888205368,3.6580019753199928,12.832448606402258,668.18,11950.97715084447,12.832448606402258,11950.97715084447,0,15,11950.97715084447]
[{"$f":"Input!A27","v":"T - 20"},{"$f":"Input!B27","v":"Soundwave"},{"$f":"Input!C27","v":"15-06-2018"},{"$f":"IF(Input!D27=\"Southern Yellow Pine\",\"SYP\",IF(Input!D27=\"Douglas-fir\",\"DF\",IF(Input!D27=\"SPF (spruce pine fir)\",\"SPF\",\"Other\")))","v":"SYP"},{"$f":"IF(RIGHT(Input!E27,4)=\"inch\",\"Imperial\",\"SI\")","v":"SI"},{"$f":"IF(E27=\"Imperial\",IF(Input!G27=\"1.5x3.5\",\"2x4\",IF(Input!G27=\"1.5x5.5\",\"2x6\",IF(Input!G27=\"1.5x7.25\",\"2x8\",IF(Input!G27=\"1.5x9.25\",\"2x10\",IF(Input!G27=\"1.5x11.25\",\"2x12\",Input!G27))))),Input!G27)","v":"3.81x18.415"},{"$f":"Input!L27","v":"No. 2"},{"$f":"IF(RIGHT(Input!E27,4)=\"inch\",VALUE(LEFT(Input!E27,LEN(Input!E27)-4)),VALUE(LEFT(Input!E27,LEN(Input!E27)-10))*0.393701)","v":1.5000008100000002},{"$f":"IF(RIGHT(Input!F27,4)=\"inch\",VALUE(LEFT(Input!F27,LEN(Input!F27)-4)),VALUE(LEFT(Input!F27,LEN(Input!F27)-10))*0.393701)","v":7.2500039149999997},{"$f":"IF(RIGHT(Input!H27,4)=\"Feet\",VALUE(LEFT(Input!H27,LEN(Input!H27)-4)),VALUE(LEFT(Input!H27,LEN(Input!H27)-5))*3.28084166666666)","v":12.001318816666643},{"$f":"IF(RIGHT(Input!I27,2)=\"LB\",VALUE(LEFT(Input!I27,LEN(Input!I27)-2)),VALUE(LEFT(Input!I27,LEN(Input!I27)-2))*2.20462)","v":28.2907295684277},{"$f":"VALUE(LEFT(Input!J27,LEN(Input!J27)-3))","v":658.21},1.6820010809831969,{"$f":"IF(Input!M27>0,Input!M27,IF(Input!N27>0,Input!N27*2.20462,K27))","v":28.2907295684277},1.6820010809831969,{"$f":"Input!O27","v":0},{"$f":"Menu!V$11","v":15},{"$f":"IF(Input!O27>0,O27*(1.857-(0.0237*Menu!V$11))/(1.857-(0.0237*Input!O27)),O27)","v":1.6820010809831969},null,"T - 20","Soundwave","15-06-2018","SYP","3.81x18.415","No. 2","SI",3.810004114801111,18.415019888205368,3.6580019753199928,12.832448606402258,658.21,11596.993773119708,12.832448606402258,11596.993773119708,0,15,11596.993773119708]
[{"$f":"Input!A28","v":"T - 21"},{"$f":"Input!B28","v":"Soundwave"},{"$f":"Input!C28","v":"15-06-2018"},{"$f":"IF(Input!D28=\"Southern Yellow Pine\",\"SYP\",IF(Input!D28=\"Douglas-fir\",\"DF\",IF(Input!D28=\"SPF (spruce pine fir)\",\"SPF\",\"Other\")))","v":"SYP"},{"$f":"IF(RIGHT(Input!E28,4)=\"inch\",\"Imperial\",\"SI\")","v":"SI"},{"$f":"IF(E28=\"Imperial\",IF(Input!G28=\"1.5x3.5\",\"2x4\",IF(Input!G28=\"1.5x5.5\",\"2x6\",IF(Input!G28=\"1.5x7.25\",\"2x8\",IF(Input!G28=\"1.5x9.25\",\"2x10\",IF(Input!G28=\"1.5x11.25\",\"2x12\",Input!G28))))),Input!G28)","v":"3.81x18.415"},{"$f":"Input!L28","v":"No. 2"},{"$f":"IF(RIGHT(Input!E28,4)=\"inch\",VALUE(LEFT(Input!E28,LEN(Input!E28)-4)),VALUE(LEFT(Input!E28,LEN(Input!E28)-10))*0.393701)","v":1.5000008100000002},{"$f":"IF(RIGHT(Input!F28,4)=\"inch\",VALUE(LEFT(Input!F28,LEN(Input!F28)-4)),VALUE(LEFT(Input!F28,LEN(Input!F28)-10))*0.393701)","v":7.2500039149999997},{"$f":"IF(RIGHT(Input!H28,4)=\"Feet\",VALUE(LEFT(Input!H28,LEN(Input!H28)-4)),VALUE(LEFT(Input!H28,LEN(Input!H28)-5))*3.28084166666666)","v":12.001318816666643},{"$f":"IF(RIGHT(Input!I28,2)=\"LB\",VALUE(LEFT(Input!I28,LEN(Input!I28)-2)),VALUE(LEFT(Input!I28,LEN(Input!I28)-2))*2.20462)","v":28.2907295684277},{"$f":"VALUE(LEFT(Input!J28,LEN(Input!J28)-3))","v":639.13},1.5858997290450378,{"$f":"IF(Input!M28>0,Input!M28,IF(Input!N28>0,Input!N28*2.20462,K28))","v":28.2907295684277},1.5858997290450378,{"$f":"Input!O28","v":0},{"$f":"Menu!V$11","v":15},{"$f":"IF(Input!O28>0,O28*(1.857-(0.0237*Menu!V$11))/(1.857-(0.0237*Input!O28)),O28)","v":1.5858997290450378},null,"T - 21","Soundwave","15-06-2018","SYP","3.81x18.415","No. 2","SI",3.810004114801111,18.415019888205368,3.6580019753199928,12.832448606402258,639.13,10934.398015830566,12.832448606402258,10934.398015830566,0,15,10934.398015830566]
[{"$f":"Input!A29","v":"T - 22"},{"$f":"Input!B29","v":"Soundwave"},{"$f":"Input!C29","v":"15-06-2018"},{"$f":"IF(Input!D29=\"Southern Yellow Pine\",\"SYP\",IF(Input!D29=\"Douglas-fir\",\"DF\",IF(Input!D29=\"SPF (spruce pine fir)\",\"SPF\",\"Other\")))","v":"SYP"},{"$f":"IF(RIGHT(Input!E29,4)=\"inch\",\"Imperial\",\"SI\")","v":"SI"},{"$f":"IF(E29=\"Imperial\",IF(Input!G29=\"1.5x3.5\",\"2x4\",IF(Input!G29=\"1.5x5.5\",\"2x6\",IF(Input!G29=\"1.5x7.25\",\"2x8\",IF(Input!G29=\"1.5x9.25\",\"2x10\",IF(Input!G29=\"1.5x11.25\",\"2x12\",Input!G29))))),Input!G29)","v":"3.81x18.415"},{"$f":"Input!L29","v":"No. 1"},{"$f":"IF(RIGHT(Input!E29,4)=\"inch\",VALUE(LEFT(Input!E29,LEN(Input!E29)-4)),VALUE(LEFT(Input!E29,LEN(Input!E29)-10))*0.393701)","v":1.5000008100000002},{"$f":"IF(RIGHT(Input!F29,4)=\"inch\",VALUE(LEFT(Input!F29,LEN(Input!F29)-4)),VALUE(LEFT(Input!F29,LEN(Input!F29)-10))*0.393701)","v":7.2500039149999997},{"$f":"IF(RIGHT(Input!H29,4)=\"Feet\",VALUE(LEFT(Input!H29,LEN(Input!H29)-4)),VALUE(LEFT(Input!H29,LEN(Input!H29)-5))*3.28084166666666)","v":12.001318816666643},{"$f":"IF(RIGHT(Input!I29,2)=\"LB\",VALUE(LEFT(Input!I29,LEN(Input!I29)-2)),VALUE(LEFT(Input!I29,LEN(Input!I29)-2))*2.20462)","v":28.2907295684277},{"$f":"VALUE(LEFT(Input!J29,LEN(Input!J29)-3))","v":711.29},1.9642226936095071,{"$f":"IF(Input!M29>0,Input!M29,IF(Input!N29>0,Input!N29*2.20462,K29))","v":28.2907295684277},1.9642226936095071,{"$f":"Input!O29","v":0},{"$f":"Menu!V$11","v":15},{"$f":"IF(Input!O29>0,O29*(1.857-(0.0237*Menu!V$11))/(1.857-(0.0237*Input!O29)),O29)","v":1.9642226936095071},null,"T - 22","Soundwave","15-06-2018","SYP","3.81x18.415","No. 1","SI",3.810004114801111,18.415019888205368,3.6580019753199928,12.832448606402258,711.29,13542.844058991086,12.832448606402258,13542.844058991086,0,15,13542.844058991086]
[{"$f":"Input!A30","v":"T - 23"},{"$f":"Input!B30","v":"Soundwave"},{"$f":"Input!C30","v":"15-06-2018"},{"$f":"IF(Input!D30=\"Southern Yellow Pine\",\"SYP\",IF(Input!D30=\"Douglas-fir\",\"DF\",IF(Input!D30=\"SPF (spruce pine fir)\",\"SPF\",\"Other\")))","v":"SYP"},{"$f":"IF(RIGHT(Input!E30,4)=\"inch\",\"Imperial\",\"SI\")","v":"Imperial"},{"$f":"IF(E30=\"Imperial\",IF(Input!G30=\"1.5x3.5\",\"2x4\",IF(Input!G30=\"1.5x5.5\",\"2x6\",IF(Input!G30=\"1.5x7.25\",\"2x8\",IF(Input!G30=\"1.5x9.25\",\"2x10\",IF(Input!G30=\"1.5x11.25\",\"2x12\",Input!G30))))),Input!G30)","v":"2x8"},{"$f":"Input!L30","v":"No. 2"},{"$f":"IF(RIGHT(Input!E30,4)=\"inch\",VALUE(LEFT(Input!E30,LEN(Input!E30)-4)),VALUE(LEFT(Input!E30,LEN(Input!E30)-10))*0.393701)","v":1.5},{"$f":"IF(RIGHT(Input!F30,4)=\"inch\",VALUE(LEFT(Input!F30,LEN(Input!F30)-4)),VALUE(LEFT(Input!F30,LEN(Input!F30)-10))*0.393701)","v":7.25},{"$f":"IF(RIGHT(Input!H30,4)=\"Feet\",VALUE(LEFT(Input!H30,LEN(Input!H30)-4)),VALUE(LEFT(Input!H30,LEN(Input!H30)-5))*3.28084166666666)","v":12.000999999999999},{"$f":"IF(RIGHT(Input!I30,2)=\"LB\",VALUE(LEFT(Input!I30,LEN(Input!I30)-2)),VALUE(LEFT(Input!I30,LEN(Input!I30)-2))*2.20462)","v":28.290033000000001},{"$f":"VALUE(LEFT(Input!J30,LEN(Input!J30)-3))","v":668.18},1.7332551577235007,{"$f":"IF(Input!M30>0,Input!M30,IF(Input!N30>0,Input!N30*2.20462,K30))","v":28.290033000000001},1.7332551577235007,{"$f":"Input!O30","v":0},{"$f":"Menu!V$11","v":15},{"$f":"IF(Input!O30>0,O30*(1.857-(0.0237*Menu!V$11))/(1.857-(0.0237*Input!O30)),O30)","v":1.7332551577235007},null,"T - 23","Soundwave","15-06-2018","SYP","2x8","No. 2","Imperial",3.8100020573999998,18.415009944099999,3.6579047999999998,12.832132648536,668.18,11950.378331265683,12.832132648536,11950.378331265683,0,15,11950.378331265683]
[{"$f":"Input!A31","v":"T - 24"},{"$f":"Input!B31","v":"Soundwave"},{"$f":"Input!C31","v":"15-06-2018"},{"$f":"IF(Input!D31=\"Southern Yellow Pine\",\"SYP\",IF(Input!D31=\"Douglas-fir\",\"DF\",IF(Input!D31=\"SPF (spruce pine fir)\",\"SPF\",\"Other\")))","v":"SYP"},{"$f":"IF(RIGHT(Input!E31,4)=\"inch\",\"Imperial\",\"SI\")","v":"Imperial"},{"$f":"IF(E31=\"Imperial\",IF(Input!G31=\"1.5x3.5\",\"2x4\",IF(Input!G31=\"1.5x5.5\",\"2x6\",IF(Input!G31=\"1.5x7.25\",\"2x8\",IF(Input!G31=\"1.5x9.25\",\"2x10\",IF(Input!G31=\"1.5x11.25\",\"2x12\",Input!G31))))),Input!G31)","v":"2x8"},{"$f":"Input!L31","v":"No. 2"},{"$f":"IF(RIGHT(Input!E31,4)=\"inch\",VALUE(LEFT(Input!E31,LEN(Input!E31)-4)),VALUE(LEFT(Input!E31,LEN(Input!E31)-10))*0.393701)","v":1.5},{"$f":"IF(RIGHT(Input!F31,4)=\"inch\",VALUE(LEFT(Input!F31,LEN(Input!F31)-4)),VALUE(LEFT(Input!F31,LEN(Input!F31)-10))*0.393701)","v":7.25},{"$f":"IF(RIGHT(Input!H31,4)=\"Feet\",VALUE(LEFT(Input!H31,LEN(Input!H31)-4)),VALUE(LEFT(Input!H31,LEN(Input!H31)-5))*3.28084166666666)","v":12.000999999999999},{"$f":"IF(RIGHT(Input!I31,2)=\"LB\",VALUE(LEFT(Input!I31,LEN(Input!I31)-2)),VALUE(LEFT(Input!I31,LEN(Input!I31)-2))*2.20462)","v":28.290033000000001},{"$f":"VALUE(LEFT(Input!J31,LEN(Input!J31)-3))","v":639.13},1.5858202654333382,{"$f":"IF(Input!M31>0,Input!M31,IF(Input!N31>0,Input!N31*2.20462,K31))","v":28.290033000000001},1.5858202654333382,{"$f":"Input!O31","v":0},{"$f":"Menu!V$11","v":15},{"$f":"IF(Input!O31>0,O31*(1.857-(0.0237*Menu!V$11))/(1.857-(0.0237*Input!O31)),O31)","v":1.5858202654333382},null,"T - 24","Soundwave","15-06-2018","SYP","2x8","No. 2","Imperial",3.8100020573999998,18.415009944099999,3.6579047999999998,12.832132648536,639.13,10933.850133299164,12.832132648536,10933.850133299164,0,15,10933.850133299164]
[{"$f":"Input!A32","v":"T - 25"},{"$f":"Input!B32","v":"Soundwave"},{"$f":"Input!C32","v":"15-06-2018"},{"$f":"IF(Input!D32=\"Southern Yellow Pine\",\"SYP\",IF(Input!D32=\"Douglas-fir\",\"DF\",IF(Input!D32=\"SPF (spruce pine fir)\",\"SPF\",\"Other\")))","v":"SYP"},{"$f":"IF(RIGHT(Input!E32,4)=\"inch\",\"Imperial\",\"SI\")","v":"Imperial"},{"$f":"IF(E32=\"Imperial\",IF(Input!G32=\"1.5x3.5\",\"2x4\",IF(Input!G32=\"1.5x5.5\",\"2x6\",IF(Input!G32=\"1.5x7.25\",\"2x8\",IF(Input!G32=\"1.5x9.25\",\"2x10\",IF(Input!G32=\"1.5x11.25\",\"2x12\",Input!G32))))),Input!G32)","v":"2x8"},{"$f":"Input!L32","v":"No. 1"},{"$f":"IF(RIGHT(Input!E32,4)=\"inch\",VALUE(LEFT(Input!E32,LEN(Input!E32)-4)),VALUE(LEFT(Input!E32,LEN(Input!E32)-10))*0.393701)","v":1.5},{"$f":"IF(RIGHT(Input!F32,4)=\"inch\",VALUE(LEFT(Input!F32,LEN(Input!F32)-4)),VALUE(LEFT(Input!F32,LEN(Input!F32)-10))*0.393701)","v":7.25},{"$f":"IF(RIGHT(Input!H32,4)=\"Feet\",VALUE(LEFT(Input!H32,LEN(Input!H32)-4)),VALUE(LEFT(Input!H32,LEN(Input!H32)-5))*3.28084166666666)","v":12.000999999999999},{"$f":"IF(RIGHT(Input!I32,2)=\"LB\",VALUE(LEFT(Input!I32,LEN(Input!I32)-2)),VALUE(LEFT(Input!I32,LEN(Input!I32)-2))*2.20462)","v":28.290033000000001},{"$f":"VALUE(LEFT(Input!J32,LEN(Input!J32)-3))","v":722.95},2.0290468786806142,{"$f":"IF(Input!M32>0,Input!M32,IF(Input!N32>0,Input!N32*2.20462,K32))","v":28.290033000000001},2.0290468786806142,{"$f":"Input!O32","v":0},{"$f":"Menu!V$11","v":15},{"$f":"IF(Input!O32>0,O32*(1.857-(0.0237*Menu!V$11))/(1.857-(0.0237*Input!O32)),O32)","v":2.0290468786806142},null,"T - 25","Soundwave","15-06-2018","SYP","2x8","No. 1","Imperial",3.8100020573999998,18.415009944099999,3.6579047999999998,12.832132648536,722.95,13989.791257251953,12.832132648536,13989.791257251953,0,15,13989.791257251953]
[{"$f":"Input!A33","v":"T - 26"},{"$f":"Input!B33","v":"Soundwave"},{"$f":"Input!C33","v":"15-06-2018"},{"$f":"IF(Input!D33=\"Southern Yellow Pine\",\"SYP\",IF(Input!D33=\"Douglas-fir\",\"DF\",IF(Input!D33=\"SPF (spruce pine fir)\",\"SPF\",\"Other\")))","v":"SYP"},{"$f":"IF(RIGHT(Input!E33,4)=\"inch\",\"Imperial\",\"SI\")","v":"Imperial"},{"$f":"IF(E33=\"Imperial\",IF(Input!G33=\"1.5x3.5\",\"2x4\",IF(Input!G33=\"1.5x5.5\",\"2x6\",IF(Input!G33=\"1.5x7.25\",\"2x8\",IF(Input!G33=\"1.5x9.25\",\"2x10\",IF(Input!G33=\"1.5x11.25\",\"2x12\",Input!G33))))),Input!G33)","v":"2x8"},{"$f":"Input!L33","v":"No. 2"},{"$f":"IF(RIGHT(Input!E33,4)=\"inch\",VALUE(LEFT(Input!E33,LEN(Input!E33)-4)),VALUE(LEFT(Input!E33,LEN(Input!E33)-10))*0.393701)","v":1.5},{"$f":"IF(RIGHT(Input!F33,4)=\"inch\",VALUE(LEFT(Input!F33,LEN(Input!F33)-4)),VALUE(LEFT(Input!F33,LEN(Input!F33)-10))*0.393701)","v":7.25},{"$f":"IF(RIGHT(Input!H33,4)=\"Feet\",VALUE(LEFT(Input!H33,LEN(Input!H33)-4)),VALUE(LEFT(Input!H33,LEN(Input!H33)-5))*3.28084166666666)","v":12.000999999999999},{"$f":"IF(RIGHT(Input!I33,2)=\"LB\",VALUE(LEFT(Input!I33,LEN(Input!I33)-2)),VALUE(LEFT(Input!I33,LEN(Input!I33)-2))*2.20462)","v":28.290033000000001},{"$f":"VALUE(LEFT(Input!J33,LEN(Input!J33)-3))","v":668.18},1.7332551577235007,{"$f":"IF(Input!M33>0,Input!M33,IF(Input!N33>0,Input!N33*2.20462,K33))","v":28.290033000000001},1.7332551577235007,{"$f":"Input!O33","v":0},{"$f":"Menu!V$11","v":15},{"$f":"IF(Input!O33>0,O33*(1.857-(0.0237*Menu!V$11))/(1.857-(0.0237*Input!O33)),O33)","v":1.7332551577235007},null,"T - 26","Soundwave","15-06-2018","SYP","2x8","No. 2","Imperial",3.8100020573999998,18.415009944099999,3.6579047999999998,12.832132648536,668.18,11950.378331265683,12.832132648536,11950.378331265683,0,15,11950.378331265683]
[{"$f":"Input!A34","v":"T - 27"},{"$f":"Input!B34","v":"Soundwave"},{"$f":"Input!C34","v":"15-06-2018"},{"$f":"IF(Input!D34=\"Southern Yellow Pine\",\"SYP\",IF(Input!D34=\"Douglas-fir\",\"DF\",IF(Input!D34=\"SPF (spruce pine fir)\",\"SPF\",\"Other\")))","v":"SYP"},{"$f":"IF(RIGHT(Input!E34,4)=\"inch\",\"Imperial\",\"SI\")","v":"Imperial"},{"$f":"IF(E34=\"Imperial\",IF(Input!G34=\"1.5x3.5\",\"2x4\",IF(Input!G34=\"1.5x5.5\",\"2x6\",IF(Input!G34=\"1.5x7.25\",\"2x8\",IF(Input!G34=\"1.5x9.25\",\"2x10\",IF(Input!G34=\"1.5x11.25\",\"2x12\",Input!G34))))),Input!G34)","v":"2x8"},{"$f":"Input!L34","v":"No. 2"},{"$f":"IF(RIGHT(Input!E34,4)=\"inch\",VALUE(LEFT(Input!E34,LEN(Input!E34)-4)),VALUE(LEFT(Input!E34,LEN(Input!E34)-10))*0.393701)","v":1.5},{"$f":"IF(RIGHT(Input!F34,4)=\"inch\",VALUE(LEFT(Input!F34,LEN(Input!F34)-4)),VALUE(LEFT(Input!F34,LEN(Input!F34)-10))*0.393701)","v":7.25},{"$f":"IF(RIGHT(Input!H34,4)=\"Feet\",VALUE(LEFT(Input!H34,LEN(Input!H34)-4)),VALUE(LEFT(Input!H34,LEN(Input!H34)-5))*3.28084166666666)","v":12.000999999999999},{"$f":"IF(RIGHT(Input!I34,2)=\"LB\",VALUE(LEFT(Input!I34,LEN(Input!I34)-2)),VALUE(LEFT(Input!I34,LEN(Input!I34)-2))*2.20462)","v":28.290033000000001},{"$f":"VALUE(LEFT(Input!J34,LEN(Input!J34)-3))","v":648.53},1.6328101756712874,{"$f":"IF(Input!M34>0,Input!M34,IF(Input!N34>0,Input!N34*2.20462,K34))","v":28.290033000000001},1.6328101756712874,{"$f":"Input!O34","v":0},{"$f":"Menu!V$11","v":15},{"$f":"IF(Input!O34>0,O34*(1.857-(0.0237*Menu!V$11))/(1.857-(0.0237*Input!O34)),O34)","v":1.6328101756712874},null,"T - 27","Soundwave","15-06-2018","SYP","2x8","No. 2","Imperial",3.8100020573999998,18.415009944099999,3.6579047999999998,12.832132648536,648.53,11257.834286811365,12.832132648536,11257.834286811365,0,15,11257.834286811365]
[{"$f":"Input!A35","v":"T - 28"},{"$f":"Input!B35","v":"Soundwave"},{"$f":"Input!C35","v":"15-06-2018"},{"$f":"IF(Input!D35=\"Southern Yellow Pine\",\"SYP\",IF(Input!D35=\"Douglas-fir\",\"DF\",IF(Input!D35=\"SPF (spruce pine fir)\",\"SPF\",\"Other\")))","v":"SYP"},{"$f":"IF(RIGHT(Input!E35,4)=\"inch\",\"Imperial\",\"SI\")","v":"Imperial"},{"$f":"IF(E35=\"Imperial\",IF(Input!G35=\"1.5x3.5\",\"2x4\",IF(Input!G35=\"1.5x5.5\",\"2x6\",IF(Input!G35=\"1.5x7.25\",\"2x8\",IF(Input!G35=\"1.5x9.25\",\"2x10\",IF(Input!G35=\"1.5x11.25\",\"2x12\",Input!G35))))),Input!G35)","v":"2x8"},{"$f":"Input!L35","v":"No. 1"},{"$f":"IF(RIGHT(Input!E35,4)=\"inch\",VALUE(LEFT(Input!E35,LEN(Input!E35)-4)),VALUE(LEFT(Input!E35,LEN(Input!E35)-10))*0.393701)","v":1.5},{"$f":"IF(RIGHT(Input!F35,4)=\"inch\",VALUE(LEFT(Input!F35,LEN(Input!F35)-4)),VALUE(LEFT(Input!F35,LEN(Input!F35)-10))*0.393701)","v":7.25},{"$f":"IF(RIGHT(Input!H35,4)=\"Feet\",VALUE(LEFT(Input!H35,LEN(Input!H35)-4)),VALUE(LEFT(Input!H35,LEN(Input!H35)-5))*3.28084166666666)","v":12.000999999999999},{"$f":"IF(RIGHT(Input!I35,2)=\"LB\",VALUE(LEFT(Input!I35,LEN(Input!I35)-2)),VALUE(LEFT(Input!I35,LEN(Input!I35)-2))*2.20462)","v":28.290033000000001},{"$f":"VALUE(LEFT(Input!J35,LEN(Input!J35)-3))","v":722.95},2.0290468786806142,{"$f":"IF(Input!M35>0,Input!M35,IF(Input!N35>0,Input!N35*2.20462,K35))","v":28.290033000000001},2.0290468786806142,{"$f":"Input!O35","v":0},{"$f":"Menu!V$11","v":15},{"$f":"IF(Input!O35>0,O35*(1.857-(0.0237*Menu!V$11))/(1.857-(0.0237*Input!O35)),O35)","v":2.0290468786806142},null,"T - 28","Soundwave","15-06-2018","SYP","2x8","No. 1","Imperial",3.8100020573999998,18.415009944099999,3.6579047999999998,12.832132648536,722.95,13989.791257251953,12.832132648536,13989.791257251953,0,15,13989.791257251953]
[{"$f":"Input!A36","v":"x"},{"$f":"Input!B36","v":"Soundwave"},{"$f":"Input!C36","v":"15-06-2018"},{"$f":"IF(Input!D36=\"Southern Yellow Pine\",\"SYP\",IF(Input!D36=\"Douglas-fir\",\"DF\",IF(Input!D36=\"SPF (spruce pine fir)\",\"SPF\",\"Other\")))","v":"SYP"},{"$f":"IF(RIGHT(Input!E36,4)=\"inch\",\"Imperial\",\"SI\")","v":"Imperial"},{"$f":"IF(E36=\"Imperial\",IF(Input!G36=\"1.5x3.5\",\"2x4\",IF(Input!G36=\"1.5x5.5\",\"2x6\",IF(Input!G36=\"1.5x7.25\",\"2x8\",IF(Input!G36=\"1.5x9.25\",\"2x10\",IF(Input!G36=\"1.5x11.25\",\"2x12\",Input!G36))))),Input!G36)","v":"2x8"},{"$f":"Input!L36","v":"No. 2"},{"$f":"IF(RIGHT(Input!E36,4)=\"inch\",VALUE(LEFT(Input!E36,LEN(Input!E36)-4)),VALUE(LEFT(Input!E36,LEN(Input!E36)-10))*0.393701)","v":1.5},{"$f":"IF(RIGHT(Input!F36,4)=\"inch\",VALUE(LEFT(Input!F36,LEN(Input!F36)-4)),VALUE(LEFT(Input!F36,LEN(Input!F36)-10))*0.393701)","v":7.25},{"$f":"IF(RIGHT(Input!H36,4)=\"Feet\",VALUE(LEFT(Input!H36,LEN(Input!H36)-4)),VALUE(LEFT(Input!H36,LEN(Input!H36)-5))*3.28084166666666)","v":12},{"$f":"IF(RIGHT(Input!I36,2)=\"LB\",VALUE(LEFT(Input!I36,LEN(Input!I36)-2)),VALUE(LEFT(Input!I36,LEN(Input!I36)-2))*2.20462)","v":28.287676000000001},{"$f":"VALUE(LEFT(Input!J36,LEN(Input!J36)-3))","v":668.18},1.7329663367344523,{"$f":"IF(Input!M36>0,Input!M36,IF(Input!N36>0,Input!N36*2.20462,K36))","v":28.287676000000001},1.7329663367344523,{"$f":"Input!O36","v":0},{"$f":"Menu!V$11","v":15},{"$f":"IF(Input!O36>0,O36*(1.857-(0.0237*Menu!V$11))/(1.857-(0.0237*Input!O36)),O36)","v":1.7329663367344523},null,"x","Soundwave","15-06-2018","SYP","2x8","No. 2","Imperial",3.8100020573999998,18.415009944099999,3.6576000000000004,12.831063532192001,668.18,11948.386979863233,12.831063532192001,11948.386979863233,0,15,11948.386979863233]
[{"$f":"Input!A37","v":"Y"},{"$f":"Input!B37","v":"Vibration"},{"$f":"Input!C37","v":"15-06-2018"},{"$f":"IF(Input!D37=\"Southern Yellow Pine\",\"SYP\",IF(Input!D37=\"Douglas-fir\",\"DF\",IF(Input!D37=\"SPF (spruce pine fir)\",\"SPF\",\"Other\")))","v":"DF"},{"$f":"IF(RIGHT(Input!E37,4)=\"inch\",\"Imperial\",\"SI\")","v":"Imperial"},{"$f":"IF(E37=\"Imperial\",IF(Input!G37=\"1.5x3.5\",\"2x4\",IF(Input!G37=\"1.5x5.5\",\"2x6\",IF(Input!G37=\"1.5x7.25\",\"2x8\",IF(Input!G37=\"1.5x9.25\",\"2x10\",IF(Input!G37=\"1.5x11.25\",\"2x12\",Input!G37))))),Input!G37)","v":"1.5x7.2"},{"$f":"Input!L37","v":"No. 1"},{"$f":"IF(RIGHT(Input!E37,4)=\"inch\",VALUE(LEFT(Input!E37,LEN(Input!E37)-4)),VALUE(LEFT(Input!E37,LEN(Input!E37)-10))*0.393701)","v":1.5},{"$f":"IF(RIGHT(Input!F37,4)=\"inch\",VALUE(LEFT(Input!F37,LEN(Input!F37)-4)),VALUE(LEFT(Input!F37,LEN(Input!F37)-10))*0.393701)","v":7.2},{"$f":"IF(RIGHT(Input!H37,4)=\"Feet\",VALUE(LEFT(Input!H37,LEN(Input!H37)-4)),VALUE(LEFT(Input!H37,LEN(Input!H37)-5))*3.28084166666666)","v":12},{"$f":"IF(RIGHT(Input!I37,2)=\"LB\",VALUE(LEFT(Input!I37,LEN(Input!I37)-2)),VALUE(LEFT(Input!I37,LEN(Input!I37)-2))*2.20462)","v":29.778130000000001},{"$f":"VALUE(LEFT(Input!J37,LEN(Input!J37)-3))","v":6.45},1.9237865664169851,{"$f":"IF(Input!M37>0,Input!M37,IF(Input!N37>0,Input!N37*2.20462,K37))","v":29.778130000000001},1.9237865664169851,{"$f":"Input!O37","v":0},{"$f":"Menu!V$11","v":15},{"$f":"IF(Input!O37>0,O37*(1.857-(0.0237*Menu!V$11))/(1.857-(0.0237*Input!O37)),O37)","v":1.9237865664169851},null,"Y","Vibration","15-06-2018","DF","1.5x7.2","No. 1","Imperial",3.8100020573999998,18.28800987552,3.6576000000000004,13.50712154296,6.45,13264.046666669172,13.50712154296,13264.046666669172,0,15,13264.046666669172]
[{"$f":"Input!A38","v":"Y - 1"},{"$f":"Input!B38","v":"Vibration"},{"$f":"Input!C38","v":"15-06-2018"},{"$f":"IF(Input!D38=\"Southern Yellow Pine\",\"SYP\",IF(Input!D38=\"Douglas-fir\",\"DF\",IF(Input!D38=\"SPF (spruce pine fir)\",\"SPF\",\"Other\")))","v":"DF"},{"$f":"IF(RIGHT(Input!E38,4)=\"inch\",\"Imperial\",\"SI\")","v":"Imperial"},{"$f":"IF(E38=\"Imperial\",IF(Input!G38=\"1.5x3.5\",\"2x4\",IF(Input!G38=\"1.5x5.5\",\"2x6\",IF(Input!G38=\"1.5x7.25\",\"2x8\",IF(Input!G38=\"1.5x9.25\",\"2x10\",IF(Input!G38=\"1.5x11.25\",\"2x12\",Input!G38))))),Input!G38)","v":"1.5x7.2"},{"$f":"Input!L38","v":"No. 2"},{"$f":"IF(RIGHT(Input!E38,4)=\"inch\",VALUE(LEFT(Input!E38,LEN(Input!E38)-4)),VALUE(LEFT(Input!E38,LEN(Input!E38)-10))*0.393701)","v":1.5},{"$f":"IF(RIGHT(Input!F38,4)=\"inch\",VALUE(LEFT(Input!F38,LEN(Input!F38)-4)),VALUE(LEFT(Input!F38,LEN(Input!F38)-10))*0.393701)","v":7.2},{"$f":"IF(RIGHT(Input!H38,4)=\"Feet\",VALUE(LEFT(Input!H38,LEN(Input!H38)-4)),VALUE(LEFT(Input!H38,LEN(Input!H38)-5))*3.28084166666666)","v":12},{"$f":"IF(RIGHT(Input!I38,2)=\"LB\",VALUE(LEFT(Input!I38,LEN(Input!I38)-2)),VALUE(LEFT(Input!I38,LEN(Input!I38)-2))*2.20462)","v":29.778130000000001},{"$f":"VALUE(LEFT(Input!J38,LEN(Input!J38)-3))","v":6.05},1.6925761143507645,{"$f":"IF(Input!M38>0,Input!M38,IF(Input!N38>0,Input!N38*2.20462,K38))","v":29.778130000000001},1.6925761143507645,{"$f":"Input!O38","v":0},{"$f":"Menu!V$11","v":15},{"$f":"IF(Input!O38>0,O38*(1.857-(0.0237*Menu!V$11))/(1.857-(0.0237*Input!O38)),O38)","v":1.6925761143507645},null,"Y - 1","Vibration","15-06-2018","DF","1.5x7.2","No. 2","Imperial",3.8100020573999998,18.28800987552,3.6576000000000004,13.50712154296,6.05,11669.906090181077,13.50712154296,11669.906090181077,0,15,11669.906090181077]
[{"$f":"Input!A39","v":"Y - 2"},{"$f":"Input!B39","v":"Vibration"},{"$f":"Input!C39","v":"15-06-2018"},{"$f":"IF(Input!D39=\"Southern Yellow Pine\",\"SYP\",IF(Input!D39=\"Douglas-fir\",\"DF\",IF(Input!D39=\"SPF (spruce pine fir)\",\"SPF\",\"Other\")))","v":"DF"},{"$f":"IF(RIGHT(Input!E39,4)=\"inch\",\"Imperial\",\"SI\")","v":"Imperial"},{"$f":"IF(E39=\"Imperial\",IF(Input!G39=\"1.5x3.5\",\"2x4\",IF(Input!G39=\"1.5x5.5\",\"2x6\",IF(Input!G39=\"1.5x7.25\",\"2x8\",IF(Input!G39=\"1.5x9.25\",\"2x10\",IF(Input!G39=\"1.5x11.25\",\"2x12\",Input!G39))))),Input!G39)","v":"1.5x7.2"},{"$f":"Input!L39","v":"No. 1"},{"$f":"IF(RIGHT(Input!E39,4)=\"inch\",VALUE(LEFT(Input!E39,LEN(Input!E39)-4)),VALUE(LEFT(Input!E39,LEN(Input!E39)-10))*0.393701)","v":1.5},{"$f":"IF(RIGHT(Input!F39,4)=\"inch\",VALUE(LEFT(Input!F39,LEN(Input!F39)-4)),VALUE(LEFT(Input!F39,LEN(Input!F39)-10))*0.393701)","v":7.2},{"$f":"IF(RIGHT(Input!H39,4)=\"Feet\",VALUE(LEFT(Input!H39,LEN(Input!H39)-4)),VALUE(LEFT(Input!H39,LEN(Input!H39)-5))*3.28084166666666)","v":12},{"$f":"IF(RIGHT(Input!I39,2)=\"LB\",VALUE(LEFT(Input!I39,LEN(Input!I39)-2)),VALUE(LEFT(Input!I39,LEN(Input!I39)-2))*2.20462)","v":29.778130000000001},{"$f":"VALUE(LEFT(Input!J39,LEN(Input!J39)-3))","v":6.64},2.0387952694837641,{"$f":"IF(Input!M39>0,Input!M39,IF(Input!N39>0,Input!N39*2.20462,K39))","v":29.778130000000001},2.0387952694837641,{"$f":"Input!O39","v":0},{"$f":"Menu!V$11","v":15},{"$f":"IF(Input!O39>0,O39*(1.857-(0.0237*Menu!V$11))/(1.857-(0.0237*Input!O39)),O39)","v":2.0387952694837641},null,"Y - 2","Vibration","15-06-2018","DF","1.5x7.2","No. 1","Imperial",3.8100020573999998,18.28800987552,3.6576000000000004,13.50712154296,6.64,14057.004072225878,13.50712154296,14057.004072225878,0,15,14057.004072225878]
[{"$f":"Input!A40","v":"Y - 3"},{"$f":"Input!B40","v":"Soundwave"},{"$f":"Input!C40","v":"15-06-2018"},{"$f":"IF(Input!D40=\"Southern Yellow Pine\",\"SYP\",IF(Input!D40=\"Douglas-fir\",\"DF\",IF(Input!D40=\"SPF (spruce pine fir)\",\"SPF\",\"Other\")))","v":"DF"},{"$f":"IF(RIGHT(Input!E40,4)=\"inch\",\"Imperial\",\"SI\")","v":"Imperial"},{"$f":"IF(E40=\"Imperial\",IF(Input!G40=\"1.5x3.5\",\"2x4\",IF(Input!G40=\"1.5x5.5\",\"2x6\",IF(Input!G40=\"1.5x7.25\",\"2x8\",IF(Input!G40=\"1.5x9.25\",\"2x10\",IF(Input!G40=\"1.5x11.25\",\"2x12\",Input!G40))))),Input!G40)","v":"1.5x7.2"},{"$f":"Input!L40","v":"No. 2"},{"$f":"IF(RIGHT(Input!E40,4)=\"inch\",VALUE(LEFT(Input!E40,LEN(Input!E40)-4)),VALUE(LEFT(Input!E40,LEN(Input!E40)-10))*0.393701)","v":1.5},{"$f":"IF(RIGHT(Input!F40,4)=\"inch\",VALUE(LEFT(Input!F40,LEN(Input!F40)-4)),VALUE(LEFT(Input!F40,LEN(Input!F40)-10))*0.393701)","v":7.2},{"$f":"IF(RIGHT(Input!H40,4)=\"Feet\",VALUE(LEFT(Input!H40,LEN(Input!H40)-4)),VALUE(LEFT(Input!H40,LEN(Input!H40)-5))*3.28084166666666)","v":12},{"$f":"IF(RIGHT(Input!I40,2)=\"LB\",VALUE(LEFT(Input!I40,LEN(Input!I40)-2)),VALUE(LEFT(Input!I40,LEN(Input!I40)-2))*2.20462)","v":29.778130000000001},{"$f":"VALUE(LEFT(Input!J40,LEN(Input!J40)-3))","v":658.21},1.7825338963098214,{"$f":"IF(Input!M40>0,Input!M40,IF(Input!N40>0,Input!N40*2.20462,K40))","v":29.778130000000001},1.7825338963098214,{"$f":"Input!O40","v":0},{"$f":"Menu!V$11","v":15},{"$f":"IF(Input!O40>0,O40*(1.857-(0.0237*Menu!V$11))/(1.857-(0.0237*Input!O40)),O40)","v":1.7825338963098214},null,"Y - 3","Soundwave","15-06-2018","DF","1.5x7.2","No. 2","Imperial",3.8100020573999998,18.28800987552,3.6576000000000004,13.50712154296,658.21,12290.143406921105,13.50712154296,12290.143406921105,0,15,12290.143406921105]
[{"$f":"Input!A41","v":"Y - 4"},{"$f":"Input!B41","v":"Soundwave"},{"$f":"Input!C41","v":"15-06-2018"},{"$f":"IF(Input!D41=\"Southern Yellow Pine\",\"SYP\",IF(Input!D41=\"Douglas-fir\",\"DF\",IF(Input!D41=\"SPF (spruce pine fir)\",\"SPF\",\"Other\")))","v":"DF"},{"$f":"IF(RIGHT(Input!E41,4)=\"inch\",\"Imperial\",\"SI\")","v":"Imperial"},{"$f":"IF(E41=\"Imperial\",IF(Input!G41=\"1.5x3.5\",\"2x4\",IF(Input!G41=\"1.5x5.5\",\"2x6\",IF(Input!G41=\"1.5x7.25\",\"2x8\",IF(Input!G41=\"1.5x9.25\",\"2x10\",IF(Input!G41=\"1.5x11.25\",\"2x12\",Input!G41))))),Input!G41)","v":"1.5x7.2"},{"$f":"Input!L41","v":"No. 2"},{"$f":"IF(RIGHT(Input!E41,4)=\"inch\",VALUE(LEFT(Input!E41,LEN(Input!E41)-4)),VALUE(LEFT(Input!E41,LEN(Input!E41)-10))*0.393701)","v":1.5},{"$f":"IF(RIGHT(Input!F41,4)=\"inch\",VALUE(LEFT(Input!F41,LEN(Input!F41)-4)),VALUE(LEFT(Input!F41,LEN(Input!F41)-10))*0.393701)","v":7.2},{"$f":"IF(RIGHT(Input!H41,4)=\"Feet\",VALUE(LEFT(Input!H41,LEN(Input!H41)-4)),VALUE(LEFT(Input!H41,LEN(Input!H41)-5))*3.28084166666666)","v":12},{"$f":"IF(RIGHT(Input!I41,2)=\"LB\",VALUE(LEFT(Input!I41,LEN(Input!I41)-2)),VALUE(LEFT(Input!I41,LEN(Input!I41)-2))*2.20462)","v":29.778130000000001},{"$f":"VALUE(LEFT(Input!J41,LEN(Input!J41)-3))","v":639.13},1.6806885888080958,{"$f":"IF(Input!M41>0,Input!M41,IF(Input!N41>0,Input!N41*2.20462,K41))","v":29.778130000000001},1.6806885888080958,{"$f":"Input!O41","v":0},{"$f":"Menu!V$11","v":15},{"$f":"IF(Input!O41>0,O41*(1.857-(0.0237*Menu!V$11))/(1.857-(0.0237*Input!O41)),O41)","v":1.6806885888080958},null,"Y - 4","Soundwave","15-06-2018","DF","1.5x7.2","No. 2","Imperial",3.8100020573999998,18.28800987552,3.6576000000000004,13.50712154296,639.13,11587.944454570506,13.50712154296,11587.944454570506,0,15,11587.944454570506]
[{"$f":"Input!A42","v":"Y - 5"},{"$f":"Input!B42","v":"Soundwave"},{"$f":"Input!C42","v":"15-06-2018"},{"$f":"IF(Input!D42=\"Southern Yellow Pine\",\"SYP\",IF(Input!D42=\"Douglas-fir\",\"DF\",IF(Input!D42=\"SPF (spruce pine fir)\",\"SPF\",\"Other\")))","v":"DF"},{"$f":"IF(RIGHT(Input!E42,4)=\"inch\",\"Imperial\",\"SI\")","v":"Imperial"},{"$f":"IF(E42=\"Imperial\",IF(Input!G42=\"1.5x3.5\",\"2x4\",IF(Input!G42=\"1.5x5.5\",\"2x6\",IF(Input!G42=\"1.5x7.25\",\"2x8\",IF(Input!G42=\"1.5x9.25\",\"2x10\",IF(Input!G42=\"1.5x11.25\",\"2x12\",Input!G42))))),Input!G42)","v":"1.5x7.2"},{"$f":"Input!L42","v":"No. 1"},{"$f":"IF(RIGHT(Input!E42,4)=\"inch\",VALUE(LEFT(Input!E42,LEN(Input!E42)-4)),VALUE(LEFT(Input!E42,LEN(Input!E42)-10))*0.393701)","v":1.5},{"$f":"IF(RIGHT(Input!F42,4)=\"inch\",VALUE(LEFT(Input!F42,LEN(Input!F42)-4)),VALUE(LEFT(Input!F42,LEN(Input!F42)-10))*0.393701)","v":7.2},{"$f":"IF(RIGHT(Input!H42,4)=\"Feet\",VALUE(LEFT(Input!H42,LEN(Input!H42)-4)),VALUE(LEFT(Input!H42,LEN(Input!H42)-5))*3.28084166666666)","v":12},{"$f":"IF(RIGHT(Input!I42,2)=\"LB\",VALUE(LEFT(Input!I42,LEN(Input!I42)-2)),VALUE(LEFT(Input!I42,LEN(Input!I42)-2))*2.20462)","v":29.778130000000001},{"$f":"VALUE(LEFT(Input!J42,LEN(Input!J42)-3))","v":735},2.2227136827979268,{"$f":"IF(Input!M42>0,Input!M42,IF(Input!N42>0,Input!N42*2.20462,K42))","v":29.778130000000001},2.2227136827979268,{"$f":"Input!O42","v":0},{"$f":"Menu!V$11","v":15},{"$f":"IF(Input!O42>0,O42*(1.857-(0.0237*Menu!V$11))/(1.857-(0.0237*Input!O42)),O42)","v":2.2227136827979268},null,"Y - 5","Soundwave","15-06-2018","DF","1.5x7.2","No. 1","Imperial",3.8100020573999998,18.28800987552,3.6576000000000004,13.50712154296,735,15325.077391607834,13.50712154296,15325.077391607834,0,15,15325.077391607834]
[{"$f":"Input!A43","v":"Y - 6"},{"$f":"Input!B43","v":"Vibration"},{"$f":"Input!C43","v":"15-06-2018"},{"$f":"IF(Input!D43=\"Southern Yellow Pine\",\"SYP\",IF(Input!D43=\"Douglas-fir\",\"DF\",IF(Input!D43=\"SPF (spruce pine fir)\",\"SPF\",\"Other\")))","v":"SPF"},{"$f":"IF(RIGHT(Input!E43,4)=\"inch\",\"Imperial\",\"SI\")","v":"SI"},{"$f":"IF(E43=\"Imperial\",IF(Input!G43=\"1.5x3.5\",\"2x4\",IF(Input!G43=\"1.5x5.5\",\"2x6\",IF(Input!G43=\"1.5x7.25\",\"2x8\",IF(Input!G43=\"1.5x9.25\",\"2x10\",IF(Input!G43=\"1.5x11.25\",\"2x12\",Input!G43))))),Input!G43)","v":"3.81x18.288"},{"$f":"Input!L43","v":"No. 2"},{"$f":"IF(RIGHT(Input!E43,4)=\"inch\",VALUE(LEFT(Input!E43,LEN(Input!E43)-4)),VALUE(LEFT(Input!E43,LEN(Input!E43)-10))*0.393701)","v":1.5000008100000002},{"$f":"IF(RIGHT(Input!F43,4)=\"inch\",VALUE(LEFT(Input!F43,LEN(Input!F43)-4)),VALUE(LEFT(Input!F43,LEN(Input!F43)-10))*0.393701)","v":7.2000038880000004},{"$f":"IF(RIGHT(Input!H43,4)=\"Feet\",VALUE(LEFT(Input!H43,LEN(Input!H43)-4)),VALUE(LEFT(Input!H43,LEN(Input!H43)-5))*3.28084166666666)","v":12.001318816666643},{"$f":"IF(RIGHT(Input!I43,2)=\"LB\",VALUE(LEFT(Input!I43,LEN(Input!I43)-2)),VALUE(LEFT(Input!I43,LEN(Input!I43)-2))*2.20462)","v":25.286058979780897},{"$f":"VALUE(LEFT(Input!J43,LEN(Input!J43)-3))","v":6.45},1.6341158995130027,{"$f":"IF(Input!M43>0,Input!M43,IF(Input!N43>0,Input!N43*2.20462,K43))","v":25.286058979780897},1.6341158995130027,{"$f":"Input!O43","v":0},{"$f":"Menu!V$11","v":15},{"$f":"IF(Input!O43>0,O43*(1.857-(0.0237*Menu!V$11))/(1.857-(0.0237*Input!O43)),O43)","v":1.6341158995130027},null,"Y - 6","Vibration","15-06-2018","SPF","3.81x18.288","No. 2","SI",3.810004114801111,18.288019751045333,3.6580019753199928,11.469554064756776,6.45,11266.836939326271,11.469554064756776,11266.836939326271,0,15,11266.836939326271]
[{"$f":"Input!A44","v":"Y - 7"},{"$f":"Input!B44","v":"Vibration"},{"$f":"Input!C44","v":"15-06-2018"},{"$f":"IF(Input!D44=\"Southern Yellow Pine\",\"SYP\",IF(Input!D44=\"Douglas-fir\",\"DF\",IF(Input!D44=\"SPF (spruce pine fir)\",\"SPF\",\"Other\")))","v":"SPF"},{"$f":"IF(RIGHT(Input!E44,4)=\"inch\",\"Imperial\",\"SI\")","v":"SI"},{"$f":"IF(E44=\"Imperial\",IF(Input!G44=\"1.5x3.5\",\"2x4\",IF(Input!G44=\"1.5x5.5\",\"2x6\",IF(Input!G44=\"1.5x7.25\",\"2x8\",IF(Input!G44=\"1.5x9.25\",\"2x10\",IF(Input!G44=\"1.5x11.25\",\"2x12\",Input!G44))))),Input!G44)","v":"3.81x18.288"},{"$f":"Input!L44","v":"No. 2"},{"$f":"IF(RIGHT(Input!E44,4)=\"inch\",VALUE(LEFT(Input!E44,LEN(Input!E44)-4)),VALUE(LEFT(Input!E44,LEN(Input!E44)-10))*0.393701)","v":1.5000008100000002},{"$f":"IF(RIGHT(Input!F44,4)=\"inch\",VALUE(LEFT(Input!F44,LEN(Input!F44)-4)),VALUE(LEFT(Input!F44,LEN(Input!F44)-10))*0.393701)","v":7.2000038880000004},{"$f":"IF(RIGHT(Input!H44,4)=\"Feet\",VALUE(LEFT(Input!H44,LEN(Input!H44)-4)),VALUE(LEFT(Input!H44,LEN(Input!H44)-5))*3.28084166666666)","v":12.001318816666643},{"$f":"IF(RIGHT(Input!I44,2)=\"LB\",VALUE(LEFT(Input!I44,LEN(Input!I44)-2)),VALUE(LEFT(Input!I44,LEN(Input!I44)-2))*2.20462)","v":25.286058979780897},{"$f":"VALUE(LEFT(Input!J44,LEN(Input!J44)-3))","v":6.05},1.4377195411796095,{"$f":"IF(Input!M44>0,Input!M44,IF(Input!N44>0,Input!N44*2.20462,K44))","v":25.286058979780897},1.4377195411796095,{"$f":"Input!O44","v":0},{"$f":"Menu!V$11","v":15},{"$f":"IF(Input!O44>0,O44*(1.857-(0.0237*Menu!V$11))/(1.857-(0.0237*Input!O44)),O44)","v":1.4377195411796095},null,"Y - 7","Vibration","15-06-2018","SPF","3.81x18.288","No. 2","SI",3.810004114801111,18.288019751045333,3.6580019753199928,11.469554064756776,6.05,9912.7311837435245,11.469554064756776,9912.7311837435245,0,15,9912.7311837435245]
[{"$f":"Input!A45","v":"Y - 8"},{"$f":"Input!B45","v":"Vibration"},{"$f":"Input!C45","v":"15-06-2018"},{"$f":"IF(Input!D45=\"Southern Yellow Pine\",\"SYP\",IF(Input!D45=\"Douglas-fir\",\"DF\",IF(Input!D45=\"SPF (spruce pine fir)\",\"SPF\",\"Other\")))","v":"SPF"},{"$f":"IF(RIGHT(Input!E45,4)=\"inch\",\"Imperial\",\"SI\")","v":"SI"},{"$f":"IF(E45=\"Imperial\",IF(Input!G45=\"1.5x3.5\",\"2x4\",IF(Input!G45=\"1.5x5.5\",\"2x6\",IF(Input!G45=\"1.5x7.25\",\"2x8\",IF(Input!G45=\"1.5x9.25\",\"2x10\",IF(Input!G45=\"1.5x11.25\",\"2x12\",Input!G45))))),Input!G45)","v":"3.81x18.288"},{"$f":"Input!L45","v":"No. 2"},{"$f":"IF(RIGHT(Input!E45,4)=\"inch\",VALUE(LEFT(Input!E45,LEN(Input!E45)-4)),VALUE(LEFT(Input!E45,LEN(Input!E45)-10))*0.393701)","v":1.5000008100000002},{"$f":"IF(RIGHT(Input!F45,4)=\"inch\",VALUE(LEFT(Input!F45,LEN(Input!F45)-4)),VALUE(LEFT(Input!F45,LEN(Input!F45)-10))*0.393701)","v":7.2000038880000004},{"$f":"IF(RIGHT(Input!H45,4)=\"Feet\",VALUE(LEFT(Input!H45,LEN(Input!H45)-4)),VALUE(LEFT(Input!H45,LEN(Input!H45)-5))*3.28084166666666)","v":12.001318816666643},{"$f":"IF(RIGHT(Input!I45,2)=\"LB\",VALUE(LEFT(Input!I45,LEN(Input!I45)-2)),VALUE(LEFT(Input!I45,LEN(Input!I45)-2))*2.20462)","v":25.286058979780897},{"$f":"VALUE(LEFT(Input!J45,LEN(Input!J45)-3))","v":6.64},1.7318073760751995,{"$f":"IF(Input!M45>0,Input!M45,IF(Input!N45>0,Input!N45*2.20462,K45))","v":25.286058979780897},1.7318073760751995,{"$f":"Input!O45","v":0},{"$f":"Menu!V$11","v":15},{"$f":"IF(Input!O45>0,O45*(1.857-(0.0237*Menu!V$11))/(1.857-(0.0237*Input!O45)),O45)","v":1.7318073760751995},null,"Y - 8","Vibration","15-06-2018","SPF","3.81x18.288","No. 2","SI",3.810004114801111,18.288019751045333,3.6580019753199928,11.469554064756776,6.64,11940.396224268243,11.469554064756776,11940.396224268243,0,15,11940.396224268243]
[{"$f":"Input!A46","v":"Y - 9"},{"$f":"Input!B46","v":"Vibration"},{"$f":"Input!C46","v":"15-06-2018"},{"$f":"IF(Input!D46=\"Southern Yellow Pine\",\"SYP\",IF(Input!D46=\"Douglas-fir\",\"DF\",IF(Input!D46=\"SPF (spruce pine fir)\",\"SPF\",\"Other\")))","v":"SPF"},{"$f":"IF(RIGHT(Input!E46,4)=\"inch\",\"Imperial\",\"SI\")","v":"Imperial"},{"$f":"IF(E46=\"Imperial\",IF(Input!G46=\"1.5x3.5\",\"2x4\",IF(Input!G46=\"1.5x5.5\",\"2x6\",IF(Input!G46=\"1.5x7.25\",\"2x8\",IF(Input!G46=\"1.5x9.25\",\"2x10\",IF(Input!G46=\"1.5x11.25\",\"2x12\",Input!G46))))),Input!G46)","v":"1.5x7.2"},{"$f":"Input!L46","v":"No. 1"},{"$f":"IF(RIGHT(Input!E46,4)=\"inch\",VALUE(LEFT(Input!E46,LEN(Input!E46)-4)),VALUE(LEFT(Input!E46,LEN(Input!E46)-10))*0.393701)","v":1.5},{"$f":"IF(RIGHT(Input!F46,4)=\"inch\",VALUE(LEFT(Input!F46,LEN(Input!F46)-4)),VALUE(LEFT(Input!F46,LEN(Input!F46)-10))*0.393701)","v":7.2},{"$f":"IF(RIGHT(Input!H46,4)=\"Feet\",VALUE(LEFT(Input!H46,LEN(Input!H46)-4)),VALUE(LEFT(Input!H46,LEN(Input!H46)-5))*3.28084166666666)","v":12.000999999999999},{"$f":"IF(RIGHT(Input!I46,2)=\"LB\",VALUE(LEFT(Input!I46,LEN(Input!I46)-2)),VALUE(LEFT(Input!I46,LEN(Input!I46)-2))*2.20462)","v":25.285429000000001},{"$f":"VALUE(LEFT(Input!J46,LEN(Input!J46)-3))","v":6.45},1.6339484914562976,{"$f":"IF(Input!M46>0,Input!M46,IF(Input!N46>0,Input!N46*2.20462,K46))","v":25.285429000000001},1.6339484914562976,{"$f":"Input!O46","v":0},{"$f":"Menu!V$11","v":15},{"$f":"IF(Input!O46>0,O46*(1.857-(0.0237*Menu!V$11))/(1.857-(0.0237*Input!O46)),O46)","v":1.6339484914562976},null,"Y - 9","Vibration","15-06-2018","SPF","1.5x7.2","No. 1","Imperial",3.8100020573999998,18.28800987552,3.6579047999999998,11.469268310967999,6.45,11265.682700953223,11.469268310967999,11265.682700953223,0,15,11265.682700953223]
[{"$f":"Input!A47","v":"Y - 10"},{"$f":"Input!B47","v":"Vibration"},{"$f":"Input!C47","v":"15-06-2018"},{"$f":"IF(Input!D47=\"Southern Yellow Pine\",\"SYP\",IF(Input!D47=\"Douglas-fir\",\"DF\",IF(Input!D47=\"SPF (spruce pine fir)\",\"SPF\",\"Other\")))","v":"SPF"},{"$f":"IF(RIGHT(Input!E47,4)=\"inch\",\"Imperial\",\"SI\")","v":"Imperial"},{"$f":"IF(E47=\"Imperial\",IF(Input!G47=\"1.5x3.5\",\"2x4\",IF(Input!G47=\"1.5x5.5\",\"2x6\",IF(Input!G47=\"1.5x7.25\",\"2x8\",IF(Input!G47=\"1.5x9.25\",\"2x10\",IF(Input!G47=\"1.5x11.25\",\"2x12\",Input!G47))))),Input!G47)","v":"1.5x7.2"},{"$f":"Input!L47","v":"No. 1"},{"$f":"IF(RIGHT(Input!E47,4)=\"inch\",VALUE(LEFT(Input!E47,LEN(Input!E47)-4)),VALUE(LEFT(Input!E47,LEN(Input!E47)-10))*0.393701)","v":1.5},{"$f":"IF(RIGHT(Input!F47,4)=\"inch\",VALUE(LEFT(Input!F47,LEN(Input!F47)-4)),VALUE(LEFT(Input!F47,LEN(Input!F47)-10))*0.393701)","v":7.2},{"$f":"IF(RIGHT(Input!H47,4)=\"Feet\",VALUE(LEFT(Input!H47,LEN(Input!H47)-4)),VALUE(LEFT(Input!H47,LEN(Input!H47)-5))*3.28084166666666)","v":12.000999999999999},{"$f":"IF(RIGHT(Input!I47,2)=\"LB\",VALUE(LEFT(Input!I47,LEN(Input!I47)-2)),VALUE(LEFT(Input!I47,LEN(Input!I47)-2))*2.20462)","v":25.285429000000001},{"$f":"VALUE(LEFT(Input!J47,LEN(Input!J47)-3))","v":6.05},1.4375722530744341,{"$f":"IF(Input!M47>0,Input!M47,IF(Input!N47>0,Input!N47*2.20462,K47))","v":25.285429000000001},1.4375722530744341,{"$f":"Input!O47","v":0},{"$f":"Menu!V$11","v":15},{"$f":"IF(Input!O47>0,O47*(1.857-(0.0237*Menu!V$11))/(1.857-(0.0237*Input!O47)),O47)","v":1.4375722530744341},null,"Y - 10","Vibration","15-06-2018","SPF","1.5x7.2","No. 1","Imperial",3.8100020573999998,18.28800987552,3.6579047999999998,11.469268310967999,6.05,9911.7156676074865,11.469268310967999,9911.7156676074865,0,15,9911.7156676074865]
[{"$f":"Input!A48","v":"Y - 11"},{"$f":"Input!B48","v":"Vibration"},{"$f":"Input!C48","v":"15-06-2018"},{"$f":"IF(Input!D48=\"Southern Yellow Pine\",\"SYP\",IF(Input!D48=\"Douglas-fir\",\"DF\",IF(Input!D48=\"SPF (spruce pine fir)\",\"SPF\",\"Other\")))","v":"SPF"},{"$f":"IF(RIGHT(Input!E48,4)=\"inch\",\"Imperial\",\"SI\")","v":"Imperial"},{"$f":"IF(E48=\"Imperial\",IF(Input!G48=\"1.5x3.5\",\"2x4\",IF(Input!G48=\"1.5x5.5\",\"2x6\",IF(Input!G48=\"1.5x7.25\",\"2x8\",IF(Input!G48=\"1.5x9.25\",\"2x10\",IF(Input!G48=\"1.5x11.25\",\"2x12\",Input!G48))))),Input!G48)","v":"1.5x7.2"},{"$f":"Input!L48","v":"No. 1"},{"$f":"IF(RIGHT(Input!E48,4)=\"inch\",VALUE(LEFT(Input!E48,LEN(Input!E48)-4)),VALUE(LEFT(Input!E48,LEN(Input!E48)-10))*0.393701)","v":1.5},{"$f":"IF(RIGHT(Input!F48,4)=\"inch\",VALUE(LEFT(Input!F48,LEN(Input!F48)-4)),VALUE(LEFT(Input!F48,LEN(Input!F48)-10))*0.393701)","v":7.2},{"$f":"IF(RIGHT(Input!H48,4)=\"Feet\",VALUE(LEFT(Input!H48,LEN(Input!H48)-4)),VALUE(LEFT(Input!H48,LEN(Input!H48)-5))*3.28084166666666)","v":12.000999999999999},{"$f":"IF(RIGHT(Input!I48,2)=\"LB\",VALUE(LEFT(Input!I48,LEN(Input!I48)-2)),VALUE(LEFT(Input!I48,LEN(Input!I48)-2))*2.20462)","v":25.285429000000001},{"$f":"VALUE(LEFT(Input!J48,LEN(Input!J48)-3))","v":6.64},1.7316299599522043,{"$f":"IF(Input!M48>0,Input!M48,IF(Input!N48>0,Input!N48*2.20462,K48))","v":25.285429000000001},1.7316299599522043,{"$f":"Input!O48","v":0},{"$f":"Menu!V$11","v":15},{"$f":"IF(Input!O48>0,O48*(1.857-(0.0237*Menu!V$11))/(1.857-(0.0237*Input!O48)),O48)","v":1.7316299599522043},null,"Y - 11","Vibration","15-06-2018","SPF","1.5x7.2","No. 1","Imperial",3.8100020573999998,18.28800987552,3.6579047999999998,11.469268310967999,6.64,11939.17298268006,11.469268310967999,11939.17298268006,0,15,11939.17298268006]
[{"$f":"Input!A49","v":"Y - 12"},{"$f":"Input!B49","v":"Soundwave"},{"$f":"Input!C49","v":"15-06-2018"},{"$f":"IF(Input!D49=\"Southern Yellow Pine\",\"SYP\",IF(Input!D49=\"Douglas-fir\",\"DF\",IF(Input!D49=\"SPF (spruce pine fir)\",\"SPF\",\"Other\")))","v":"SPF"},{"$f":"IF(RIGHT(Input!E49,4)=\"inch\",\"Imperial\",\"SI\")","v":"Imperial"},{"$f":"IF(E49=\"Imperial\",IF(Input!G49=\"1.5x3.5\",\"2x4\",IF(Input!G49=\"1.5x5.5\",\"2x6\",IF(Input!G49=\"1.5x7.25\",\"2x8\",IF(Input!G49=\"1.5x9.25\",\"2x10\",IF(Input!G49=\"1.5x11.25\",\"2x12\",Input!G49))))),Input!G49)","v":"1.5x7.2"},{"$f":"Input!L49","v":"No. 1"},{"$f":"IF(RIGHT(Input!E49,4)=\"inch\",VALUE(LEFT(Input!E49,LEN(Input!E49)-4)),VALUE(LEFT(Input!E49,LEN(Input!E49)-10))*0.393701)","v":1.5},{"$f":"IF(RIGHT(Input!F49,4)=\"inch\",VALUE(LEFT(Input!F49,LEN(Input!F49)-4)),VALUE(LEFT(Input!F49,LEN(Input!F49)-10))*0.393701)","v":7.2},{"$f":"IF(RIGHT(Input!H49,4)=\"Feet\",VALUE(LEFT(Input!H49,LEN(Input!H49)-4)),VALUE(LEFT(Input!H49,LEN(Input!H49)-5))*3.28084166666666)","v":12.000999999999999},{"$f":"IF(RIGHT(Input!I49,2)=\"LB\",VALUE(LEFT(Input!I49,LEN(Input!I49)-2)),VALUE(LEFT(Input!I49,LEN(Input!I49)-2))*2.20462)","v":25.285429000000001},{"$f":"VALUE(LEFT(Input!J49,LEN(Input!J49)-3))","v":648.53},1.4695287285148104,{"$f":"IF(Input!M49>0,Input!M49,IF(Input!N49>0,Input!N49*2.20462,K49))","v":25.285429000000001},1.4695287285148104,{"$f":"Input!O49","v":0},{"$f":"Menu!V$11","v":15},{"$f":"IF(Input!O49>0,O49*(1.857-(0.0237*Menu!V$11))/(1.857-(0.0237*Input!O49)),O49)","v":1.4695287285148104},null,"Y - 12","Soundwave","15-06-2018","SPF","1.5x7.2","No. 1","Imperial",3.8100020573999998,18.28800987552,3.6579047999999998,11.469268310967999,648.53,10132.047896214775,11.469268310967999,10132.047896214775,0,15,10132.047896214775]
[{"$f":"Input!A50","v":"Y - 13"},{"$f":"Input!B50","v":"Soundwave"},{"$f":"Input!C50","v":"15-06-2018"},{"$f":"IF(Input!D50=\"Southern Yellow Pine\",\"SYP\",IF(Input!D50=\"Douglas-fir\",\"DF\",IF(Input!D50=\"SPF (spruce pine fir)\",\"SPF\",\"Other\")))","v":"SPF"},{"$f":"IF(RIGHT(Input!E50,4)=\"inch\",\"Imperial\",\"SI\")","v":"Imperial"},{"$f":"IF(E50=\"Imperial\",IF(Input!G50=\"1.5x3.5\",\"2x4\",IF(Input!G50=\"1.5x5.5\",\"2x6\",IF(Input!G50=\"1.5x7.25\",\"2x8\",IF(Input!G50=\"1.5x9.25\",\"2x10\",IF(Input!G50=\"1.5x11.25\",\"2x12\",Input!G50))))),Input!G50)","v":"1.5x7.2"},{"$f":"Input!L50","v":"No. 1"},{"$f":"IF(RIGHT(Input!E50,4)=\"inch\",VALUE(LEFT(Input!E50,LEN(Input!E50)-4)),VALUE(LEFT(Input!E50,LEN(Input!E50)-10))*0.393701)","v":1.5},{"$f":"IF(RIGHT(Input!F50,4)=\"inch\",VALUE(LEFT(Input!F50,LEN(Input!F50)-4)),VALUE(LEFT(Input!F50,LEN(Input!F50)-10))*0.393701)","v":7.2},{"$f":"IF(RIGHT(Input!H50,4)=\"Feet\",VALUE(LEFT(Input!H50,LEN(Input!H50)-4)),VALUE(LEFT(Input!H50,LEN(Input!H50)-5))*3.28084166666666)","v":12.000999999999999},{"$f":"IF(RIGHT(Input!I50,2)=\"LB\",VALUE(LEFT(Input!I50,LEN(Input!I50)-2)),VALUE(LEFT(Input!I50,LEN(Input!I50)-2))*2.20462)","v":25.285429000000001},{"$f":"VALUE(LEFT(Input!J50,LEN(Input!J50)-3))","v":639.13},1.4272378216636146,{"$f":"IF(Input!M50>0,Input!M50,IF(Input!N50>0,Input!N50*2.20462,K50))","v":25.285429000000001},1.4272378216636146,{"$f":"Input!O50","v":0},{"$f":"Menu!V$11","v":15},{"$f":"IF(Input!O50>0,O50*(1.857-(0.0237*Menu!V$11))/(1.857-(0.0237*Input!O50)),O50)","v":1.4272378216636146},null,"Y - 13","Soundwave","15-06-2018","SPF","1.5x7.2","No. 1","Imperial",3.8100020573999998,18.28800987552,3.6579047999999998,11.469268310967999,639.13,9840.4622432934229,11.469268310967999,9840.4622432934229,0,15,9840.4622432934229]
[{"$f":"Input!A51","v":"Y - 14"},{"$f":"Input!B51","v":"Soundwave"},{"$f":"Input!C51","v":"15-06-2018"},{"$f":"IF(Input!D51=\"Southern Yellow Pine\",\"SYP\",IF(Input!D51=\"Douglas-fir\",\"DF\",IF(Input!D51=\"SPF (spruce pine fir)\",\"SPF\",\"Other\")))","v":"SPF"},{"$f":"IF(RIGHT(Input!E51,4)=\"inch\",\"Imperial\",\"SI\")","v":"Imperial"},{"$f":"IF(E51=\"Imperial\",IF(Input!G51=\"1.5x3.5\",\"2x4\",IF(Input!G51=\"1.5x5.5\",\"2x6\",IF(Input!G51=\"1.5x7.25\",\"2x8\",IF(Input!G51=\"1.5x9.25\",\"2x10\",IF(Input!G51=\"1.5x11.25\",\"2x12\",Input!G51))))),Input!G51)","v":"1.5x7.2"},{"$f":"Input!L51","v":"No. 1"},{"$f":"IF(RIGHT(Input!E51,4)=\"inch\",VALUE(LEFT(Input!E51,LEN(Input!E51)-4)),VALUE(LEFT(Input!E51,LEN(Input!E51)-10))*0.393701)","v":1.5},{"$f":"IF(RIGHT(Input!F51,4)=\"inch\",VALUE(LEFT(Input!F51,LEN(Input!F51)-4)),VALUE(LEFT(Input!F51,LEN(Input!F51)-10))*0.393701)","v":7.2},{"$f":"IF(RIGHT(Input!H51,4)=\"Feet\",VALUE(LEFT(Input!H51,LEN(Input!H51)-4)),VALUE(LEFT(Input!H51,LEN(Input!H51)-5))*3.28084166666666)","v":12.000999999999999},{"$f":"IF(RIGHT(Input!I51,2)=\"LB\",VALUE(LEFT(Input!I51,LEN(Input!I51)-2)),VALUE(LEFT(Input!I51,LEN(Input!I51)-2))*2.20462)","v":25.285429000000001},{"$f":"VALUE(LEFT(Input!J51,LEN(Input!J51)-3))","v":722.95},1.8261416569740576,{"$f":"IF(Input!M51>0,Input!M51,IF(Input!N51>0,Input!N51*2.20462,K51))","v":25.285429000000001},1.8261416569740576,{"$f":"Input!O51","v":0},{"$f":"Menu!V$11","v":15},{"$f":"IF(Input!O51>0,O51*(1.857-(0.0237*Menu!V$11))/(1.857-(0.0237*Input!O51)),O51)","v":1.8261416569740576},null,"Y - 14","Soundwave","15-06-2018","SPF","1.5x7.2","No. 1","Imperial",3.8100020573999998,18.28800987552,3.6579047999999998,11.469268310967999,722.95,12590.808450838455,11.469268310967999,12590.808450838455,0,15,12590.808450838455]